program: Orca
programVersion: 5.0.3
elementType: C H C H C C C H H C H H C C H H H H H H H
charge: 1
multiplicity: 1
keywords: m062x def2-TZVP EnGrad RIJCOSX verytightscf def2/J soscf
formula: C8H13
InChI: InChI=1/C8H13/c1-3-7-5-2-6-8(4-1)9-7/h3,6-8H,1-2,4-5H2
21 atoms
C  -1.996904 0.672268 0.102554
H  -2.192785 0.863771 1.161999
C  -1.823505 -0.93062 -0.131868
H  -2.64137 -1.433736 0.386931
C  -0.453201 -1.335178 0.396384
C  0.689262 -1.272095 -0.366646
C  2.000022 -0.670989 0.0916
H  2.200267 -0.872694 1.148349
H  2.850593 -1.011541 -0.501594
C  1.826562 0.929808 -0.130732
H  1.909393 1.15166 -1.199472
H  2.641096 1.434601 0.391806
C  0.452183 1.320755 0.402351
C  -0.694014 1.285379 -0.357433
H  0.540392 -1.240623 -1.449896
H  -1.908449 -1.142648 -1.202382
H  0.003058 -0.000902 0.138685
H  -0.55427 1.283148 -1.442118
H  -2.853316 1.010742 -0.483321
H  0.345533 1.342883 1.489906
H  -0.345389 -1.382335 1.482963
totalener: -312.25111632 hartree
nucrepener: 382.84391369 hartree
electener: -695.09503002 hartree
oneelecener: -1165.98128127 hartree
twoeener: 470.88625125 hartree
kineticenergy: 310.35997376 hartree
xcener: -23.104287371930 hartree
chargesum: 1.0000000
charge: -0.311648 0.206051 -0.332015 0.207800 -0.110102 -0.070215 -0.311911 0.205431 0.206555 -0.332462 0.208967 0.207664 -0.112286 -0.069953 0.192706 0.209466 0.192976 0.192410 0.206451 0.207905 0.206208
charge: -0.203011 0.157235 -0.200894 0.159873 -0.134459 -0.093493 -0.203297 0.157058 0.159990 -0.201189 0.156710 0.159660 -0.137525 -0.091034 0.167977 0.156870 0.325797 0.167581 0.160070 0.168271 0.167809
qa: -0.3116 0.2061 -0.3320 0.2078 -0.1101 -0.0702 -0.3119 0.2054 0.2066 -0.3325 0.2090 0.2077 -0.1123 -0.0700 0.1927 0.2095 0.1930 0.1924 0.2065 0.2079 0.2062
va: 3.7429 0.9488 3.7721 0.9566 3.6191 3.6838 3.7437 0.9490 0.9561 3.7734 0.9471 0.9568 3.6132 3.6905 0.9500 0.9469 0.9362 0.9502 0.9560 0.9478 0.9487
energy: -312.251116324166
dipole: -0.00488 -0.00254 -0.00742 0.00282 -0.00424 -0.00142 -0.07285 0.05736 -0.01549
magnitude: 0.01723 au
magnitude: 0.04380 debye
