program: Gaussian 09
title: 000050973
version: EM64L-G09RevD.01
frameworkgroup: C1[X(C7H12N2O5)]
method: RPBEPBE
basis: SDD
operation: Freq
keyword: #p
keyword: freq=noraman
keyword: PBEPBE/SDD
title: #p freq=noraman PBEPBE/SDD
converged: YES YES NO NO
title: Mulliken charges:
elementType: O O O O O N N C C C C C C C H H H H H H H H H H H H
charge: -0.260630 -0.233384 -0.243702 -0.240839 -0.253288 -0.068848 0.075063 -0.362891 -0.253835 -0.313292 0.298637 0.311571 -0.747841 -0.742428 0.247834 0.258090 0.237860 0.255952 0.256701 0.269428 0.250132 0.249849 0.248348 0.256031 0.256399 0.249084
chargesum: 0.00000
title: Mulliken charges with hydrogens summed into heavy atoms:
elementType: O O O O O N N C C C C C C C
charge: -0.260630 -0.233384 -0.243702 -0.240839 -0.253288 -0.068848 0.075063 0.143033 0.239977 0.212837 0.298637 0.311571 0.000488 0.019086
polarizability: 1.29588094e+02 1.35443456e+01 1.17817153e+02 2.31669696e-02 7.36759060e-01 8.51983676e+01
1716.lowfreq: -5.8584 -3.2713 -0.0007 -0.0004 -0.0002 5.7355 10.1767 18.6035 28.4308
frequency: 7.4243 18.5370 28.3627 39.2667 45.0395 54.4630 65.4893 96.3153 106.3278 176.3742 180.7024 203.3912 237.5422 268.5075 320.0436 338.3095 380.2425 409.9004 449.4604 525.2132 564.7565 576.2535 615.5682 627.1391 665.7718 772.7734 790.7934 822.9740 854.1164 873.9640 928.5424 954.8411 984.1837 1005.8314 1040.3525 1043.1631 1044.7718 1080.2944 1143.6600 1187.8786 1199.9929 1221.1160 1239.0649 1290.7178 1314.8133 1337.4360 1369.5099 1380.5596 1384.8843 1387.8123 1397.8306 1431.1359 1451.3442 1452.6415 1453.1549 1454.9795 1462.2411 1480.5592 1651.7159 1658.6715 3008.5750 3009.8641 3014.6447 3030.4904 3053.5103 3079.6078 3098.8183 3098.9935 3104.8656 3130.9024 3144.3277 3145.9448
redmass: 1.0994 4.9369 5.5296 2.9366 1.2706 5.8587 4.3712 4.4542 3.4459 3.4914 4.1052 7.1319 5.5675 5.5569 6.2053 3.0435 3.0735 2.9292 3.5301 4.5029 3.0400 3.5939 4.9044 4.6477 5.0398 3.3112 1.3906 5.8442 5.1149 5.4126 5.4001 3.9065 1.8973 2.4889 1.8790 1.6637 1.7106 3.3619 1.8103 3.0473 3.5209 1.4647 2.0084 1.3501 1.2694 1.3330 2.4803 1.2347 1.2737 1.2919 1.7823 1.1931 1.0623 1.0483 1.0583 1.0499 1.0771 1.0789 8.6794 9.6165 1.0376 1.0373 1.0573 1.0585 1.0557 1.1062 1.0964 1.0961 1.1064 1.1093 1.1014 1.1015
irintensity: 0.8542 0.3428 3.5704 0.4145 2.5790 1.1357 1.0383 7.1524 0.4184 1.5513 9.1073 6.3792 3.8933 7.0289 6.0645 2.1428 14.5276 10.5023 8.5927 13.6544 2.7373 7.7719 5.1421 3.8535 10.1896 9.3434 32.6440 35.2389 52.7879 326.0577 82.1833 38.7804 75.3978 114.4800 10.8271 10.9163 21.3296 1.6468 62.3475 207.3655 367.2771 40.2421 5.2551 25.4887 3.9420 5.3493 73.2823 14.2842 74.5675 32.7995 36.6795 36.0907 33.7099 17.5853 25.9699 18.3827 11.3384 14.2962 181.5011 188.8468 1.5629 0.8473 7.2976 19.9089 16.0043 4.5435 4.6799 6.9715 14.9956 6.6688 9.0575 7.3391
temp: 298.150 k
press: 1.00000 atm
elementType: 8 8 8 8 8 7 7 6 6 6 6 6 6 6 1 1 1 1 1 1 1 1 1 1 1 1
symmnumber: 1
zpe: 517201.1 jmol-1
zpe.correction: 0.196991 hartree
zpe.thermalcorrener: 0.213544 hartree
zpe.thermalcorrenthalpy: 0.214488 hartree
zpe.thermalcorrgfe: 0.146788 hartree
zpe.sumelectzpe: -758.402537 hartree
zpe.sumelectthermal: -758.385985 hartree
zpe.sumelectthermalent: -758.385040 hartree
zpe.sumelectthermalfe: -758.452741 hartree
dipole: 0.1297 -2.8827 -1.6471
dipole: 3.3226
quadrupole: -77.8394 -90.3524 -82.6613
quadrupole: -13.6639 10.3658 5.4717
quadrupole: 5.7783 -6.7347 0.9564 -13.6639 10.3658 5.4717
hfenergy: -758.5995287 hartree
pointgroup: C01 [X(C7H12N2O5)]
dipole: 0.2956634 1.2450168 0.266997 debye
dipolederiv: -1.329003 0.5058917 -0.4383112 0.480652 -0.5341032 0.1248827 -0.5320454 0.1806532 -0.6920702 -0.5953436 -0.3114996 0.0788378 -0.3808781 -1.4489246 0.2468222 -0.0761504 0.0986464 -0.3797485 -0.4961306 0.7926359 -0.3084445 0.2367672 -0.9420436 0.3764805 0.102812 -0.1194459 -0.1846919 -0.5869572 0.1744881 -0.0172007 0.0337078 -0.4211765 -0.2434718 -0.3605018 -0.0158888 -0.9206429 -0.7802972 0.2238757 -0.2721257 -0.0858125 -0.7148809 0.1125377 -0.1817579 0.2507185 -0.4658202 -0.4224535 -0.2177956 0.0649442 0.1903184 -0.8249592 0.2143352 -0.1602712 0.6694111 -0.6006387 0.1280755 -0.6741637 0.2514258 -0.3889015 1.4221819 -0.7424466 0.1493579 -0.5540539 0.2790051 0.4426746 -0.1633128 0.0815236 -0.1318642 0.2521847 0.0666069 0.0392557 0.1066321 0.1131431 0.6496282 -0.1554661 0.0773846 -0.1982975 0.4221658 -0.1089286 -0.043536 -0.0467084 0.185319 0.7236209 0.7059622 -0.2530344 0.3726628 0.4708357 0.045914 -0.0268159 0.0316849 0.4250736 1.3953058 -0.6243719 0.3469635 -0.4621887 0.5735402 0.2142627 0.7835225 -0.0535541 1.336118 0.9928349 -0.1001277 0.4201144 0.3298496 1.6961725 -0.2967043 0.3082485 -0.4098147 0.4680273 -0.2436294 0.1959924 0.0857891 0.1771245 -0.1079892 -0.0805443 0.1334124 -0.1331966 -0.1087622 -0.3287953 -0.2022179 -0.1074576 -0.1426275 -0.1196487 -0.0172354 -0.1083373 -0.0455784 -0.015514 0.0016334 -0.0222298 -0.0609009 -0.0100699 -0.0704539 -0.0552402 -0.0591818 -0.0344672 0.085701 0.0316228 0.0070462 0.0517749 -0.0495685 0.0876574 0.0574989 0.0660954 0.0194935 0.0051869 -0.0389348 -0.0294462 -0.041316 0.0091551 -0.0941164 -0.0266876 0.0066616 -0.0443898 0.0573196 0.0058324 0.0254767 0.0401619 0.0259574 0.0170536 0.0638777 0.1092545 0.0097034 -0.012783 0.033439 -0.1286538 -0.0413738 -0.0208248 0.0789873 0.0928327 -0.067148 0.0104616 -0.0025663 0.0270323 -0.0290897 0.0499305 0.0316392 0.0297311 -0.080293 -0.0246918 0.0096056 0.1400313 0.0608097 -0.0840913 -0.0499226 -0.0351546 0.0092972 -0.0768344 -0.0531262 -0.0655555 0.0901007 0.0608363 -0.017043 0.0667883 -0.0520606 0.0437867 0.0770587 0.073892 0.0673877 0.0480033 0.031422 0.0652289 -0.0654516 0.0711999 0.0767633 0.0211558 -0.0954492 0.0542017 0.0053282 0.1329841 0.0000025 -0.0091253 -0.024898 0.0901801 0.0582222 -0.0449237 0.0260991 -0.0439313 0.0175784 0.0198428 0.0659538 0.0311171 0.0864622 -0.0593593 0.0906533 -0.0342602 0.0705333 0.0862144 0.0430659 -0.0169283 -0.0070045 -0.0787036 0.0152576 -0.0292294 0.0222147 0.1182788 unknown
polarizability: 121.7720995|-12.8571988|120.629222|7.641876|-12.9804475|90.2022931 unknown
InChI: InChI=1S/C7H12N2O5/c1-6(10)13-4-3-9(8-12)5-14-7(2)11/h3-5H2,1-2H3
charge 0 multiplicity 1
26 atoms
O  -2.445258 0.774509 0.222817
O  2.754122 -0.136903 0.16505
O  1.588252 -3.210347 1.384088
O  -3.446254 0.608685 -1.874012
O  1.593102 1.640091 -0.813225
N  0.646947 -1.26359 0.689115
N  0.63774 -2.379276 1.561665
C  -0.427676 -0.286742 0.945172
C  -1.380111 -0.146631 -0.251902
C  1.686142 -1.074618 -0.30679
C  -3.445503 1.080047 -0.71677
C  2.591985 1.21784 -0.188762
C  -4.472448 2.008856 -0.109707
C  3.779433 2.024616 0.277711
H  0.000208 0.701218 1.187845
H  -0.979609 -0.657362 1.825055
H  -1.831244 -1.113586 -0.538604
H  -0.887008 0.303363 -1.131321
H  1.259931 -0.680141 -1.242645
H  2.208711 -2.033691 -0.440127
H  -3.978476 2.837936 0.422901
H  -5.084143 1.458679 0.627713
H  -5.128412 2.400335 -0.900361
H  3.999719 1.807905 1.336153
H  4.673759 1.743304 -0.306349
H  3.578092 3.096502 0.140487
