program: Gaussian 09
title: 000051040
version: EM64L-G09RevD.01
frameworkgroup: C1[X(C20H22O3)]
method: RPBEPBE
basis: SDD
operation: Freq
keyword: #pfreq=noraman
keyword: PBEPBE/SDD
title: #p freq=noraman PBEPBE/SDD
converged: YES YES NO NO
title: Mulliken charges:
elementType: O O O C C C C C C C C C C C C C C C C C C C C H H H H H H H H H H H H H H H H H H H H H H
charge: -0.230644 -0.238060 -0.255810 0.130716 0.497002 -0.746750 -0.697432 -0.695996 -0.422446 -0.418690 0.311331 -0.390946 -0.389696 0.135062 -0.688907 0.145181 0.305896 -0.326799 -0.363664 -0.382039 -0.360380 0.333405 -0.536666 0.218214 0.217287 0.218487 0.223771 0.218785 0.210372 0.218933 0.209659 0.224787 0.232468 0.252201 0.283088 0.272324 0.259355 0.259892 0.287474 0.274620 0.256972 0.244857 0.226866 0.226176 0.249744
chargesum: 0.00000
title: Mulliken charges with hydrogens summed into heavy atoms:
elementType: O O O C C C C C C C C C C C C C C C C C C C C
charge: -0.230644 -0.238060 -0.255810 0.130716 0.497002 -0.092762 -0.044503 -0.042616 -0.189978 -0.166488 0.311331 -0.107858 -0.117371 0.135062 -0.169660 0.145181 0.305896 -0.039325 -0.089044 -0.125067 -0.115523 0.333405 0.166119
polarizability: 3.56940634e+02 4.81276149e+00 1.94453070e+02 -2.32925682e+01 -2.17681986e+01 1.85861285e+02
1716.lowfreq: -8.9011 -2.0638 -0.0003 0.0003 0.0009 4.2808 11.4220 30.0090 44.7592
frequency: 11.1729 29.7778 44.7458 50.5351 65.8226 72.7632 85.9552 103.8380 128.5813 142.7228 174.6814 180.4787 211.9551 215.4877 235.6488 247.1647 258.1762 276.1244 298.6934 306.6872 322.6155 326.7592 333.9907 385.5891 395.1951 407.0170 417.0772 434.2076 445.3480 474.5936 484.6814 508.6492 513.0184 548.5077 560.2312 602.0715 623.3212 626.1897 632.5684 666.2162 725.6191 743.5454 758.6808 783.2261 808.6408 827.6346 833.8826 851.9092 857.0570 869.9993 919.6897 933.0865 935.0129 944.1670 973.5861 978.5822 982.5052 985.8089 989.6409 997.9518 999.5736 1009.7854 1020.4404 1025.6244 1045.8164 1108.2059 1110.8816 1118.5261 1127.7909 1145.1588 1157.7865 1176.7844 1202.4626 1207.8681 1215.1104 1238.0582 1243.0813 1265.5939 1274.8945 1303.0641 1312.2795 1317.5335 1366.7758 1373.9241 1376.4531 1377.3156 1404.9346 1414.2677 1430.5138 1436.9748 1459.9585 1462.1263 1465.8968 1467.7715 1468.2470 1470.6215 1479.3366 1486.1949 1495.8413 1501.0190 1505.3477 1541.7162 1556.5439 1579.5429 1583.1390 1615.5988 1621.1873 2968.0612 2973.9161 2974.9446 2979.7416 3038.5552 3060.0843 3069.8597 3070.1651 3071.9739 3078.4997 3080.5548 3084.3176 3107.5142 3129.3582 3131.5654 3144.9770 3145.9525 3147.4467 3150.0774 3167.1685 3168.8305 3172.6006
redmass: 5.4138 3.0199 5.7281 3.7512 4.0465 4.1880 5.2618 6.4168 5.4388 4.9022 4.2610 2.6457 1.2589 1.1969 2.5907 4.1335 1.2194 2.7814 3.8192 1.0862 3.6433 3.0004 3.7262 2.9002 4.1854 2.8575 3.0068 2.8544 3.3933 3.6959 4.0386 4.1298 3.2000 2.9883 4.2118 4.2702 4.4356 5.5612 6.9973 3.7441 3.6935 4.8000 3.9916 5.3552 3.1963 1.3095 2.5898 1.6000 1.3632 1.8573 1.7296 1.6455 2.5771 1.2018 2.0969 3.8271 1.6210 1.4617 2.0259 1.4665 2.7042 2.4489 1.4987 1.3888 3.0829 2.3614 1.2591 1.3689 1.4251 1.3881 1.3178 1.2998 2.9571 1.2162 2.5361 2.0122 2.8123 1.7767 3.0296 3.2046 1.3002 1.3317 4.7100 5.0909 1.2255 1.2190 1.2002 3.4429 2.9205 1.3568 1.0504 1.1237 1.0483 1.0501 1.0637 1.0693 1.0705 1.0520 1.1783 2.2319 1.9139 9.5886 7.0989 7.1292 7.6261 6.1126 6.4579 1.0325 1.0350 1.0347 1.0358 1.0576 1.1044 1.1003 1.0999 1.1004 1.0987 1.0997 1.0991 1.1044 1.0878 1.1000 1.0906 1.0878 1.0876 1.0963 1.0957 1.0950 1.0962
irintensity: 1.1541 0.1797 1.9833 0.4663 0.5310 0.2126 1.1108 0.7785 12.4277 0.8644 13.9160 0.8053 0.0416 0.0300 1.8445 1.4772 0.4814 1.1450 2.7085 0.2759 0.5024 1.2959 0.5738 0.1644 1.6691 0.4384 0.2985 3.4373 2.6249 3.2242 2.4926 10.1263 18.5748 30.2360 54.9764 17.0136 2.1359 1.1895 0.5946 5.1966 2.4639 0.3326 1.7427 6.0421 23.2489 1.3994 10.8692 56.2402 18.2152 57.0239 5.0596 1.8864 110.8580 0.5448 10.9010 67.8877 3.8467 12.0797 0.2843 1.4058 26.8789 8.3705 10.5264 0.3156 76.1127 58.4873 0.2144 20.4935 17.1578 26.6793 1.1324 341.3843 5.1506 78.4353 4.9254 356.0185 193.0910 229.9548 11.0710 69.5503 3.7908 2.0479 9.0719 43.9513 20.5551 19.1342 8.5544 19.2688 0.8763 11.7318 0.0164 29.1992 0.8275 14.8251 1.8045 60.1823 22.0888 11.7168 9.9334 81.4217 5.2506 275.2239 17.7943 151.2286 33.5789 208.0391 94.1468 71.5971 28.7200 31.8243 35.2209 4.9591 41.8499 2.0953 2.1857 23.0011 125.0541 30.3929 46.6790 9.6563 10.3701 23.0550 3.0743 0.9712 1.0951 13.4213 12.6203 15.5979 10.5245
temp: 298.150 k
press: 1.00000 atm
elementType: 8 8 8 6 6 6 6 6 6 6 6 6 6 6 6 6 6 6 6 6 6 6 6 1 1 1 1 1 1 1 1 1 1 1 1 1 1 1 1 1 1 1 1 1 1
symmnumber: 1
zpe: 963190.2 jmol-1
zpe.correction: 0.366860 hartree
zpe.thermalcorrener: 0.389364 hartree
zpe.thermalcorrenthalpy: 0.390308 hartree
zpe.thermalcorrgfe: 0.313660 hartree
zpe.sumelectzpe: -999.319111 hartree
zpe.sumelectthermal: -999.296607 hartree
zpe.sumelectthermalent: -999.295663 hartree
zpe.sumelectthermalfe: -999.372310 hartree
dipole: 0.4583 -2.5515 -0.4404
dipole: 2.6295
quadrupole: -94.8487 -134.8417 -139.6273
quadrupole: -11.1127 -0.0919 5.4520
quadrupole: 28.2572 -11.7358 -16.5214 -11.1127 -0.0919 5.4520
hfenergy: -999.6859704 hartree
pointgroup: C01 [X(C20H22O3)]
dipole: 0.1496127 0.8965582 -0.4940041 debye
polarizability: 354.0282773|20.4786778|171.3071409|25.6169267|-7.0314738|211.9195705 unknown
InChI: InChI=1S/C20H22O3/c1-20(2,3)16-9-5-14(6-10-16)18(21)13-19(22)15-7-11-17(23-4)12-8-15/h5-12H,13H2,1-4H3
charge 0 multiplicity 1
45 atoms
O  0.262849 -2.058552 2.299356
O  1.008339 -1.406035 -2.051835
O  6.122506 0.990367 1.094379
C  -5.476873 0.144142 -0.206536
C  -4.088423 -0.433946 0.150976
C  -6.266488 0.608605 1.043963
C  -6.315069 -0.94869 -0.937882
C  -5.292215 1.371023 -1.151467
C  -3.228254 -0.900051 -0.883158
C  -3.613737 -0.523145 1.488339
C  -1.495835 -1.52117 0.738067
C  -1.957907 -1.436746 -0.605194
C  -2.34279 -1.052369 1.77792
C  -0.157609 -2.073533 1.102046
C  0.728311 -2.689699 -0.003112
C  1.452705 -1.647627 -0.886385
C  2.663483 -0.965224 -0.354843
C  3.13478 -1.147847 0.979747
C  3.377979 -0.088493 -1.216984
C  4.282748 -0.478212 1.427101
C  4.533132 0.583286 -0.782873
C  4.989979 0.384808 0.548924
C  6.901782 1.895787 0.240753
H  -5.735249 1.409297 1.590991
H  -6.456523 -0.226116 1.74376
H  -7.24701 1.011798 0.731597
H  -6.478271 -1.82392 -0.282852
H  -5.814546 -1.301534 -1.857024
H  -7.302498 -0.540372 -1.22387
H  -4.769053 1.095199 -2.084112
H  -6.278738 1.789243 -1.42644
H  -4.704716 2.165213 -0.65576
H  -3.553281 -0.840631 -1.927968
H  -4.240661 -0.175775 2.314393
H  -1.317681 -1.759302 -1.433219
H  -1.97838 -1.115006 2.808916
H  1.464692 -3.334468 0.503651
H  0.115243 -3.30605 -0.680341
H  2.587997 -1.789974 1.678019
H  3.001442 0.049114 -2.236148
H  4.652581 -0.601127 2.449114
H  5.06503 1.248036 -1.469766
H  6.293703 2.76148 -0.084036
H  7.301889 1.365301 -0.644201
H  7.731037 2.240316 0.874994
