program: Orca
programVersion: 5.0.3
elementType: C H C H C C C H H C H H C C H H H H H H H
charge: 1
multiplicity: 1
keywords: b3lyp def2-TZVP EnGrad D3BJ RIJCOSX verytightscf def2/J soscf
formula: C8H13
InChI: InChI=1/C8H13/c1-2-4-6-8-7-5-3-1/h1-2,7H,3-6,8H2
21 atoms
C  -1.998455 0.526662 0.119076
H  -2.177613 0.722737 1.179689
C  -1.965562 -1.000671 -0.168233
H  -2.67689 -1.595828 0.406205
C  -0.524007 -1.124004 0.278537
C  0.606881 -1.112528 -0.507481
C  1.906063 -0.647581 0.062583
H  2.003131 -0.953033 1.109803
H  2.757755 -1.045503 -0.495571
C  1.902481 0.918249 -0.030518
H  2.038547 1.215889 -1.076781
H  2.747279 1.324483 0.531841
C  0.561284 1.48059 0.487342
C  -0.538385 0.796335 -0.258334
H  0.528213 -1.295616 -1.578647
H  -2.085862 -1.214778 -1.234173
H  0.44721 1.368859 1.570588
H  -0.41722 0.86268 -1.342589
H  -2.705639 1.105076 -0.483318
H  0.511485 2.557203 0.261198
H  -0.37258 -1.073463 1.357919
totalener: -312.25420563 hartree
nucrepener: 385.98833548 hartree
electener: -698.24254111 hartree
oneelecener: -1172.86090512 hartree
twoeener: 474.61836400 hartree
kineticenergy: 310.55953732 hartree
exchangeener: -36.347493690329 hartree
correlationener: -2.309158258011 hartree
xcener: -38.656651948340 hartree
chargesum: 1.0000000
charge: -0.179449 0.152618 -0.182118 0.166787 -0.044283 -0.033529 -0.206425 0.150522 0.165095 -0.220030 0.144962 0.162579 -0.168741 -0.051210 0.189980 0.147871 0.139734 0.166577 0.164756 0.171178 0.163128
charge: -0.191152 0.154740 -0.185105 0.151971 -0.058574 -0.024715 -0.204375 0.157284 0.160964 -0.206634 0.149377 0.153711 -0.222652 0.014651 0.165763 0.154149 0.153473 0.172182 0.153826 0.178193 0.172923
qa: -0.1794 0.1526 -0.1821 0.1668 -0.0443 -0.0335 -0.2064 0.1505 0.1651 -0.2200 0.1450 0.1626 -0.1687 -0.0512 0.1900 0.1479 0.1397 0.1666 0.1648 0.1712 0.1631
va: 3.8602 0.9737 3.8558 0.9718 3.8069 3.7601 3.8857 0.9670 0.9692 3.8586 0.9684 0.9668 3.8848 3.7223 0.9515 0.9733 0.9736 0.9601 0.9700 0.9646 0.9650
dispcorr: -0.035231640 hartree
energy: -312.289437270504
dipole: 0.56023 -0.69904 -0.13881 1.85220 -1.78494 0.06726 0.19305 -0.34789 -0.15484
magnitude: 0.21856 au
magnitude: 0.55553 debye
