program: Gaussian 09
title: 000051176
version: EM64L-G09RevD.01
frameworkgroup: C1[X(C18H26N2O4)]
method: RPBEPBE
basis: SDD
operation: Freq
keyword: #p
keyword: freq=noraman
keyword: PBEPBE/SDD
title: #p freq=noraman PBEPBE/SDD
converged: NO YES NO NO
title: Mulliken charges:
elementType: O O O O N N C C C C C C C C C C C C C C C C C C H H H H H H H H H H H H H H H H H H H H H H H H H H
charge: -0.300101 -0.286086 -0.289737 -0.293166 -0.061728 -0.120197 -0.071603 -0.093841 -0.487697 -0.408021 -0.411139 -0.444357 -0.421586 -0.612989 0.182018 0.346091 -0.577749 -0.503656 0.240921 0.286218 0.055231 -0.500791 -0.533460 -0.522559 0.202415 0.205647 0.219418 0.213272 0.225567 0.174284 0.177950 0.215080 0.213304 0.260776 0.251065 0.209736 0.228718 0.218023 0.185493 0.277038 0.274211 0.225747 0.252223 0.203834 0.227156 0.230124 0.239953 0.267166 0.203478 0.228304
chargesum: 0.00000
title: Mulliken charges with hydrogens summed into heavy atoms:
elementType: O O O O N N C C C C C C C C C C C C C C C C C C
charge: -0.300101 -0.286086 -0.289737 -0.293166 -0.061728 -0.120197 0.130812 0.111807 -0.055007 -0.008169 -0.018109 0.029723 0.039215 0.019245 0.182018 0.346091 -0.300711 -0.229445 0.240921 0.286218 0.055231 0.181013 0.163773 0.176389
polarizability: 2.86159193e+02 -6.24518041e+00 2.31493578e+02 1.68663895e+01 7.10451168e+00 1.61956186e+02
1716.lowfreq: -28.3201 -11.5961 -3.9422 0.0003 0.0004 0.0005 13.3520 22.9255 39.5626
frequency: 7.8698 17.3501 39.3582 51.2195 54.5496 84.2844 98.7129 105.7233 111.3592 118.9342 147.1987 159.9620 174.2208 177.8479 205.5396 217.7791 224.4557 246.1960 266.5524 275.8157 287.7516 292.8079 305.4465 311.5697 325.9414 346.2983 362.1254 371.2347 383.5624 397.1945 405.2761 441.2906 462.2267 491.6879 515.5848 525.3892 569.6202 595.7889 619.2519 664.4077 678.7871 687.3035 732.2019 737.4093 750.3754 793.0954 805.5011 818.5171 861.5596 867.4622 885.3355 893.6291 914.3518 922.3554 925.2148 947.7793 959.2853 978.2604 982.9348 991.8719 1015.3216 1053.3228 1068.8872 1077.5137 1096.6613 1105.1735 1107.1377 1109.8852 1113.5523 1114.3626 1124.3882 1128.4634 1129.7602 1150.3706 1153.7787 1157.7787 1160.2335 1188.1585 1199.9778 1221.1126 1223.1002 1244.7077 1258.6106 1273.5633 1295.1960 1296.2734 1316.4603 1326.3041 1332.5377 1336.8066 1351.7925 1363.3626 1367.5001 1376.1068 1378.2552 1397.2565 1409.2015 1421.3119 1430.2120 1438.5513 1442.9672 1450.3746 1452.0602 1453.6780 1457.1976 1459.1670 1463.9505 1465.1144 1469.7448 1470.0437 1472.1793 1481.1552 1481.9727 1483.5720 1484.5435 1546.0871 1579.0878 1600.8504 2788.1053 2800.8709 2840.1351 2945.9788 2953.1299 2965.1964 2966.5221 2970.0213 2974.8005 2996.4981 3000.9154 3006.3907 3011.0826 3018.2925 3032.6084 3056.4781 3071.9064 3077.8177 3078.8761 3085.4474 3090.8886 3122.0233 3123.6208 3124.8300 3165.3667 3176.8409
redmass: 4.1387 3.9872 4.6740 3.0407 5.6139 3.2230 3.4948 3.1026 2.0572 3.2098 1.7394 2.1158 1.3141 2.9425 2.3317 2.5305 1.1882 3.2033 2.3142 2.2870 3.4905 4.8301 3.4823 5.1476 2.2646 2.2127 3.6368 2.9980 2.7147 2.8195 3.0014 4.6807 4.3830 3.5506 6.3443 3.4223 5.7802 5.3455 5.1912 4.9477 4.8534 5.4596 5.1390 4.3717 4.2330 3.7648 2.9361 3.6859 1.7530 5.3409 1.5774 1.6379 1.7673 2.4239 2.8464 8.8229 1.9370 2.0888 3.5363 3.7047 3.0782 1.6461 5.1349 2.0426 1.2797 1.5561 1.2505 1.2413 1.2833 1.6587 1.7361 1.4618 1.6095 1.4756 1.3785 1.6376 2.0493 2.4880 1.1292 1.5102 1.6146 2.4621 1.4681 2.3443 3.3681 1.6321 2.0469 1.3554 1.5217 1.8413 1.3819 1.4375 1.3556 3.8372 1.5671 2.7291 2.0991 1.3276 1.1733 1.2929 1.2806 1.1040 1.1012 1.1080 1.1044 1.0621 1.0512 1.0786 1.1886 1.3455 1.0554 1.1038 1.4882 1.1430 1.0682 8.0111 8.1998 6.7329 1.0717 1.0699 1.0585 1.0702 1.0691 1.0340 1.0346 1.0617 1.0348 1.0849 1.0851 1.0852 1.0708 1.0874 1.1029 1.1043 1.1010 1.0929 1.0949 1.0964 1.0914 1.1054 1.1006 1.1048 1.0915 1.0910
irintensity: 0.8835 0.0223 3.0536 4.9567 4.8928 0.8131 5.9346 0.0079 1.2005 2.7085 1.4672 3.8649 0.4216 4.6116 3.2724 1.0163 0.5922 4.7352 0.9127 2.5699 4.5140 9.1753 2.0479 7.2503 2.5495 0.2241 10.9591 5.7841 0.5154 0.6608 14.1364 3.2819 2.6791 0.5282 7.2800 2.3828 1.6082 1.0216 22.4544 1.6425 9.2385 7.5022 16.4395 10.2106 6.9062 18.2067 2.8315 1.1266 11.9342 15.5135 19.1321 29.8623 1.8252 2.3537 0.2977 59.2532 0.6868 7.0415 37.7829 13.3961 45.1640 11.2256 210.6602 39.8609 1.8713 2.2680 8.2387 15.2912 0.1028 2.0528 4.0555 8.4899 18.3107 16.7888 18.0046 24.7852 44.8779 88.1650 2.3114 36.2381 41.2902 37.4081 1.2372 10.4919 143.1535 37.5029 120.2666 1.6996 20.0008 52.5208 1.0325 2.9236 17.2726 15.9223 33.3328 59.2076 192.1162 43.2621 1.3478 20.2912 24.0369 33.7572 13.8870 4.1751 7.8370 23.4056 13.0351 4.6849 16.5873 35.8280 31.1562 30.8886 18.7428 7.2550 13.5511 260.1625 78.3899 1.7055 68.4789 158.0512 255.5932 29.2286 65.1813 89.0593 55.6669 32.9388 93.3517 28.9512 133.2115 69.3835 30.4797 18.5799 49.3180 39.5869 28.2895 10.1972 36.5437 47.1565 8.4969 20.0933 22.7371 18.1843 2.1390 2.1107
temp: 298.150 k
press: 1.00000 atm
elementType: 8 8 8 8 7 7 6 6 6 6 6 6 6 6 6 6 6 6 6 6 6 6 6 6 1 1 1 1 1 1 1 1 1 1 1 1 1 1 1 1 1 1 1 1 1 1 1 1 1 1
symmnumber: 1
zpe: 1094965.6 jmol-1
zpe.correction: 0.417050 hartree
zpe.thermalcorrener: 0.441321 hartree
zpe.thermalcorrenthalpy: 0.442265 hartree
zpe.thermalcorrgfe: 0.361328 hartree
zpe.sumelectzpe: -1110.008520 hartree
zpe.sumelectthermal: -1109.984249 hartree
zpe.sumelectthermalent: -1109.983305 hartree
zpe.sumelectthermalfe: -1110.064242 hartree
dipole: 0.1452 0.4659 -1.7246
dipole: 1.7923
quadrupole: -115.4071 -128.7818 -153.5703
quadrupole: -4.8680 -9.0758 -2.8489
quadrupole: 17.1793 3.8046 -20.9839 -4.8680 -9.0758 -2.8489
hfenergy: -1110.42557 hartree
pointgroup: C01 [X(C18H26N2O4)]
dipole: -0.0582004 -0.3985457 -0.578784 debye
polarizability: 285.3217335|-15.247189|220.9849081|-10.1007989|-27.4640674|173.3023152 unknown
InChI: InChI=1S/C18H26N2O4/c1-19-8-12-5-13(9-19)11-20(10-12)18(21)14-6-15(22-2)17(24-4)16(7-14)23-3/h6-7,12-13H,5,8-11H2,1-4H3
charge 0 multiplicity 1
50 atoms
O  -1.311785 0.125731 2.401748
O  3.181854 1.954164 -0.981318
O  2.896345 -2.579609 0.879442
O  4.368154 -0.685622 -0.534704
N  -3.250243 -1.227373 -0.344892
N  -1.86378 1.235861 0.424429
C  -4.366472 0.956872 0.218356
C  -2.95428 0.776268 -1.816032
C  -4.272867 1.370753 -1.269372
C  -4.40978 -0.588268 0.31759
C  -3.030686 -0.767004 -1.731893
C  -3.184046 1.593193 0.993453
C  -1.743333 1.37821 -1.045203
C  -3.266835 -2.692446 -0.22286
C  -0.983137 0.51971 1.232101
C  0.407583 0.233327 0.720349
C  0.965447 -1.028328 1.042573
C  1.193762 1.196236 0.057851
C  2.533997 0.911086 -0.304705
C  2.285209 -1.33168 0.658351
C  3.09417 -0.3679 -0.025707
C  4.645083 2.105538 -0.898346
C  2.083997 -3.618822 1.519524
C  5.395754 -1.115582 0.439074
H  -5.301485 1.349402 0.665589
H  -2.824089 1.052738 -2.881589
H  -5.13776 0.981431 -1.841451
H  -4.2778 2.474268 -1.367711
H  -4.407028 -0.897362 1.380131
H  -5.380874 -0.936861 -0.131484
H  -3.850407 -1.111425 -2.422124
H  -2.087854 -1.218017 -2.099302
H  -3.296487 2.697914 0.962453
H  -3.177379 1.267424 2.046434
H  -0.81413 0.891809 -1.377347
H  -1.672291 2.456519 -1.305006
H  -3.322894 -2.975687 0.843596
H  -2.334384 -3.113489 -0.641589
H  -4.130009 -3.172676 -0.754351
H  0.34738 -1.73505 1.601254
H  0.815121 2.199638 -0.156439
H  4.838136 3.119235 -1.283925
H  5.15817 1.347888 -1.510423
H  4.992742 2.03335 0.150493
H  1.1823 -3.844536 0.918704
H  1.782092 -3.321643 2.541904
H  2.735301 -4.504298 1.563845
H  5.076144 -2.032257 0.959745
H  5.594174 -0.309193 1.173223
H  6.297799 -1.306435 -0.162538
