program: Orca
programVersion: 5.0.3
charge: 1
multiplicity: 1
keywords: DLPNO-CCSD(T1) tightPNO Extrapolate(3/4,def2) RIJK def2/JK verytightSCF miniprint nopop
formula: C8H13
InChI: InChI=1/C8H13/c1-2-4-6-8-7-5-3-1/h1-2,7H,3-6,8H2
21 atoms
C  -1.997358 0.748845 0.074373
H  -2.179187 0.853911 1.147174
C  -1.740002 -0.948079 -0.150024
H  -2.618464 -1.325742 0.378413
C  -0.424029 -1.376292 0.399808
C  0.691601 -1.282706 -0.36915
C  2.005276 -0.687879 0.06563
H  2.216939 -0.878799 1.123463
H  2.857968 -1.028875 -0.52666
C  1.795328 0.880626 -0.144948
H  1.84921 1.128873 -1.210273
H  2.603303 1.419832 0.355117
C  0.422018 1.252866 0.466634
C  -0.761884 1.314125 -0.379276
H  0.527988 -1.212844 -1.449184
H  -1.841348 -1.122382 -1.222042
H  0.143413 0.388326 1.084093
H  -0.643736 1.472236 -1.454969
H  -2.87569 0.984298 -0.52623
H  0.413227 2.015991 1.266559
H  -0.344156 -1.505767 1.480115
e0: -310.257638203 hartree
corrType: DLPNO BASED
e0: -310.271294843 hartree
basis: def2-TZVPP def2-QZVPP
scfener: -310.257638203 -310.271294843
corrmethod: MDCI MDCI
correner: -1.457483637 -1.527863376
corrcbsextra: -1.579996477
energy: -311.853172368251
dipole: 0.10252 -0.99019 -0.88767 1.11381 0.10335 1.21716 0.41744 -0.59065 -0.17321
magnitude: 1.51639 au
magnitude: 3.85436 debye
