program: Orca
programVersion: 5.0.3
elementType: C H C H C C C H H C H H C C H H H H H H H
charge: 1
multiplicity: 1
keywords: DSD-PBEP86 def2-TZVP RIJCOSX verytightscf def2-TZVP/C def2/J soscf noTRAH
formula: C8H13
InChI: InChI=1/C8H13/c1-3-7-5-2-6-8(4-1)9-7/h3,6-8H,1-2,4-5H2
21 atoms
C  -2.00546 0.689551 0.091679
H  -2.215572 0.876435 1.149048
C  -1.800155 -0.92128 -0.136855
H  -2.629573 -1.417918 0.369778
C  -0.440501 -1.336348 0.408119
C  0.697625 -1.277899 -0.361988
C  2.009349 -0.681833 0.081638
H  2.222336 -0.881684 1.136275
H  2.85593 -1.013447 -0.522296
C  1.812056 0.915343 -0.137102
H  1.87913 1.138123 -1.206832
H  2.629379 1.429288 0.371956
C  0.438103 1.305518 0.412471
C  -0.710147 1.302012 -0.356401
H  0.533132 -1.208384 -1.44157
H  -1.8734 -1.13217 -1.208231
H  0.009233 0.024839 0.292343
H  -0.559231 1.27567 -1.439629
H  -2.860071 1.006675 -0.508208
H  0.342339 1.410363 1.496632
H  -0.34426 -1.451814 1.490245
totalener: -311.10136403 hartree
nucrepener: 382.64978840 hartree
electener: -693.75115243 hartree
oneelecener: -1165.24670872 hartree
twoeener: 471.49555629 hartree
kineticenergy: 309.93165548 hartree
exchangeener: -12.751507942566 hartree
correlationener: -0.949414288379 hartree
xcener: -13.700922230945 hartree
chargesum: 1.0000000
charge: -0.218706 0.166718 -0.263426 0.183764 -0.127167 -0.039139 -0.219619 0.164479 0.180102 -0.266939 0.170022 0.182821 -0.115136 -0.031992 0.159976 0.171201 0.174812 0.166533 0.181986 0.192470 0.187243
charge: -0.193098 0.151737 -0.190512 0.154005 -0.152959 -0.066250 -0.196472 0.150960 0.153727 -0.192310 0.149777 0.153298 -0.154177 -0.043727 0.163023 0.150118 0.315525 0.164756 0.154592 0.165614 0.162374
qa: -0.2187 0.1667 -0.2634 0.1838 -0.1272 -0.0391 -0.2196 0.1645 0.1801 -0.2669 0.1700 0.1828 -0.1151 -0.0320 0.1600 0.1712 0.1748 0.1665 0.1820 0.1925 0.1872
va: 3.8650 0.9713 3.9368 0.9671 3.7689 3.8758 3.8714 0.9714 0.9672 3.9401 0.9671 0.9682 3.7338 3.8825 0.9659 0.9672 1.0247 0.9632 0.9665 0.9604 0.9621
total: -311.798180361 hartree
energy: -311.798180360994
dipole: -0.00994 -0.04454 -0.05448 0.05284 0.03973 0.09256 -0.01901 -0.03137 -0.05038
magnitude: 0.11863 au
magnitude: 0.30154 debye
