program: Gaussian 09
title: 000050981
version: EM64L-G09RevD.01
frameworkgroup: C1[X(C11H18N4O3)]
method: RPBEPBE
basis: SDD
operation: Freq
keyword: #p
keyword: freq=noraman
keyword: PBEPBE/SDD
title: #p freq=noraman PBEPBE/SDD
converged: YES YES NO NO
title: Mulliken charges:
elementType: O O O N N N N C C C C C C C C C C C H H H H H H H H H H H H H H H H H H
charge: -0.461214 -0.245648 -0.169016 -0.101023 -0.118589 -0.031891 0.075818 -0.367438 -0.360338 -0.405168 -0.389497 -0.397902 -0.365539 -0.087747 -0.409226 0.172228 -0.118497 -0.307472 0.176747 0.237387 0.209647 0.172557 0.222871 0.196287 0.192857 0.204678 0.216969 0.187601 0.185764 0.222988 0.240571 0.225317 0.296420 0.348365 0.287226 0.263907
chargesum: 0.00000
title: Mulliken charges with hydrogens summed into heavy atoms:
elementType: O O O N N N N C C C C C C C C C C C
charge: -0.112849 -0.245648 -0.169016 -0.101023 -0.118589 -0.031891 0.075818 0.046696 0.021866 0.013990 0.008038 0.006669 0.043213 0.152824 0.112512 0.172228 0.168729 -0.043564
polarizability: 2.01429837e+02 -8.63570710e+00 1.74804659e+02 3.31929825e+00 -7.54439044e+00 1.09412389e+02
1716.lowfreq: -8.6541 -0.0008 0.0002 0.0007 3.9684 11.0710 23.1480 32.0350 44.5370
frequency: 22.3187 31.9275 44.4526 49.7515 68.4039 101.7740 123.6216 145.5468 179.2257 227.8663 233.3726 248.0839 271.0534 272.7356 308.4208 319.2730 353.2441 377.3468 422.0288 441.0530 448.1882 460.5260 480.8319 545.8456 573.2337 617.4483 631.4485 700.1577 726.1669 759.9902 765.2181 781.2720 803.0831 838.0970 853.0568 854.4028 861.5017 884.0706 897.6667 914.5878 957.0525 995.2967 1017.2417 1039.9580 1049.2591 1060.3572 1062.4365 1095.8830 1109.6741 1118.0287 1121.5741 1143.1622 1153.5038 1159.7990 1164.2110 1189.6286 1234.6675 1244.0007 1254.3923 1265.7239 1273.4090 1291.8941 1298.0669 1312.1027 1323.0389 1332.2315 1341.6941 1342.6658 1346.3633 1351.4314 1357.2924 1366.2721 1373.6271 1378.6305 1398.6503 1414.7434 1448.3767 1452.0736 1457.0044 1460.1301 1465.7475 1467.6145 1477.3115 1479.2294 2819.8856 2827.4361 2842.0508 2967.5692 2985.4404 2994.7048 3000.9655 3019.4955 3026.7461 3035.9533 3038.7744 3048.8701 3058.5157 3062.4426 3126.4181 3235.0503 3262.5740 3575.3902
redmass: 5.1294 4.6450 6.9474 4.1996 5.3643 5.6262 3.8169 3.4993 5.6200 5.0485 1.8969 1.1321 2.4471 7.5641 4.7567 2.1831 3.4928 1.8056 6.4635 2.2506 2.8230 2.7462 3.6971 5.2519 2.0460 5.2292 4.2864 11.8713 5.1664 3.8486 4.8967 1.3692 1.4837 2.5786 1.5842 2.5998 1.4600 4.6740 2.2355 2.1414 1.3061 2.5118 2.6637 2.2516 2.1022 1.9536 1.7173 1.6448 2.5328 2.3838 2.6883 3.3635 1.2542 2.4076 1.6197 1.3049 3.0993 1.6837 1.3579 1.3005 1.2714 1.8473 1.7295 1.3333 1.4164 1.3300 2.2956 1.6625 1.6140 1.5340 7.6495 2.9561 1.4299 1.4624 1.4622 3.0169 1.8506 1.0939 1.0974 1.0875 1.1094 1.1142 1.1053 1.5919 1.0710 1.0716 1.0695 1.0631 1.0617 1.0616 1.0837 1.0881 1.0846 1.0948 1.0682 1.1033 1.0956 1.0952 1.1001 1.0931 1.1075 1.0663
irintensity: 1.0543 0.6558 1.3319 0.4582 4.4998 0.9559 1.3361 0.6245 1.8281 1.0992 1.5638 123.5215 2.6531 11.3257 16.1346 0.9754 6.6799 3.2318 8.2991 13.8594 1.1255 4.4671 2.4502 7.0173 0.5316 13.7023 2.1931 1.2276 23.0359 9.3147 15.2408 49.3577 0.3140 18.5524 0.5201 5.6882 6.2969 7.0058 10.3487 14.5348 4.6836 24.8414 7.5841 30.2436 25.8107 27.7411 36.6099 5.4404 19.5513 16.1631 3.9123 91.1102 6.3195 43.6092 4.4526 5.9192 22.8479 20.0734 19.4488 1.1338 11.9320 53.5076 98.3325 44.4154 22.3805 4.2741 52.9359 17.6011 14.7401 4.2437 226.8875 19.3212 2.1186 15.4698 11.6205 6.1801 14.1319 8.8934 3.4518 14.2482 4.9328 12.4561 9.2510 10.1625 51.2837 37.5774 267.8584 43.1723 30.3764 27.8408 3.8615 29.7406 34.8388 57.6475 37.3176 33.4213 48.1270 53.9812 9.9993 4.5204 0.3538 8.5504
temp: 298.150 k
press: 1.00000 atm
elementType: 8 8 8 7 7 7 7 6 6 6 6 6 6 6 6 6 6 6 1 1 1 1 1 1 1 1 1 1 1 1 1 1 1 1 1 1
symmnumber: 1
zpe: 772859.6 jmol-1
zpe.correction: 0.294367 hartree
zpe.thermalcorrener: 0.311679 hartree
zpe.thermalcorrenthalpy: 0.312623 hartree
zpe.thermalcorrgfe: 0.247329 hartree
zpe.sumelectzpe: -873.130177 hartree
zpe.sumelectthermal: -873.112864 hartree
zpe.sumelectthermalent: -873.111920 hartree
zpe.sumelectthermalfe: -873.177214 hartree
dipole: -3.4035 -6.0039 -0.0565
dipole: 6.9017
quadrupole: -110.2399 -115.6863 -101.2723
quadrupole: -13.7913 2.9818 2.9740
quadrupole: -1.1737 -6.6201 7.7938 -13.7913 2.9818 2.9740
hfenergy: -873.4245433 hartree
pointgroup: C01 [X(C11H18N4O3)]
dipole: 1.3208597 -2.3632331 0.2084959 debye
polarizability: 201.1136784|8.5220962|175.3613005|6.6800406|4.2095251|109.1719049 unknown
InChI: InChI=1S/C11H18N4O3/c16-10(8-13-5-2-1-3-6-13)9-14-7-4-12-11(14)15(17)18/h4,7,10,16H,1-3,5-6,8-9H2
charge 0 multiplicity 1
36 atoms
O  -0.791199 -2.715988 0.986694
O  -0.521402 1.7445 0.259971
O  -2.348797 3.065672 -0.140773
N  2.274807 -0.661488 0.089763
N  -2.004934 -0.535937 -0.560066
N  -3.910096 0.71974 -0.349705
N  -1.777634 1.917963 -0.063036
C  2.440191 0.416394 1.105216
C  3.585583 -1.094326 -0.465566
C  3.151199 1.642477 0.498838
C  4.319358 0.089025 -1.12719
C  4.510266 1.246032 -0.119923
C  1.467327 -1.797573 0.577559
C  -0.044393 -1.476964 0.685482
C  -0.592641 -0.973493 -0.654167
C  -2.55875 0.73359 -0.330483
C  -3.087794 -1.390213 -0.720322
C  -4.247917 -0.603759 -0.589911
H  3.028079 0.0370 1.983162
H  1.444734 0.721275 1.469234
H  3.401056 -1.89319 -1.208559
H  4.240619 -1.527306 0.33644
H  2.494477 2.079636 -0.276657
H  3.287364 2.408348 1.28594
H  5.295943 -0.257031 -1.517417
H  3.719305 0.443046 -1.987677
H  4.978498 2.116954 -0.615962
H  5.202911 0.921436 0.684549
H  1.814598 -2.173147 1.577592
H  1.574432 -2.639437 -0.133446
H  -0.235008 -0.715253 1.466864
H  -0.549004 -1.798534 -1.387152
H  0.044926 -0.146603 -0.997123
H  -0.599214 -2.999831 1.915237
H  -2.94237 -2.453491 -0.887589
H  -5.286718 -0.918724 -0.646515
