program: Orca
programVersion: 5.0.3
elementType: C H C H C C C H H C H H C C H H H H H H H
charge: 1
multiplicity: 1
keywords: DSD-PBEP86 cc-pVTZ EnGrad D3BJ RIJCOSX verytightscf cc-pVTZ/C def2/J soscf
formula: C8H13
InChI: InChI=1/C8H13/c1-2-4-6-8-7-5-3-1/h1-2,7H,3-6,8H2
21 atoms
C  -1.999288 0.523304 0.11658
H  -2.180586 0.724731 1.175756
C  -1.97688 -1.004902 -0.164804
H  -2.678298 -1.600968 0.42035
C  -0.531002 -1.106559 0.275424
C  0.602314 -1.099382 -0.511677
C  1.904826 -0.642386 0.05884
H  1.999235 -0.954549 1.104325
H  2.751817 -1.045886 -0.502284
C  1.9118 0.924194 -0.023736
H  2.060897 1.228753 -1.066096
H  2.7524 1.320557 0.551754
C  0.565465 1.478707 0.484204
C  -0.526669 0.764279 -0.25245
H  0.523597 -1.289093 -1.581628
H  -2.103573 -1.226187 -1.228392
H  0.453349 1.377977 1.568876
H  -0.411535 0.836678 -1.337145
H  -2.692299 1.111554 -0.491989
H  0.497196 2.550631 0.245234
H  -0.377558 -1.057909 1.35444
totalener: -311.15295257 hartree
nucrepener: 386.56704692 hartree
electener: -697.71999949 hartree
oneelecener: -1173.33311320 hartree
twoeener: 475.61311371 hartree
kineticenergy: 309.75202155 hartree
exchangeener: -13.673812871137 hartree
correlationener: -0.927280124683 hartree
xcener: -14.601092995820 hartree
chargesum: 1.0000000
charge: -0.212970 0.167038 -0.238419 0.184077 -0.053487 -0.048228 -0.250664 0.164513 0.183394 -0.248518 0.160807 0.181426 -0.233757 -0.081899 0.225042 0.167864 0.161286 0.197094 0.182315 0.193621 0.199465
charge: 0.102580 -0.000439 0.105632 -0.001008 0.122501 0.177872 0.084612 0.001997 0.006799 0.097536 -0.006303 -0.000100 0.065694 0.206840 0.004344 -0.000519 -0.002429 0.002920 -0.000794 0.019606 0.012657
qa: -0.2130 0.1670 -0.2384 0.1841 -0.0535 -0.0482 -0.2507 0.1645 0.1834 -0.2485 0.1608 0.1814 -0.2338 -0.0819 0.2250 0.1679 0.1613 0.1971 0.1823 0.1936 0.1995
va: 3.8662 0.9865 3.8869 0.9769 3.7953 3.7751 3.9216 0.9837 0.9764 3.8934 0.9814 0.9731 3.8957 3.7566 0.9598 0.9861 0.9847 0.9798 0.9749 0.9684 0.9783
dispcorr: -0.011492857 hartree
energy: -311.858506900893
dipole: 0.55725 -0.69379 -0.13654 1.84993 -1.87075 -0.02081 0.19965 -0.36405 -0.16440
magnitude: 0.21472 au
magnitude: 0.54576 debye
