program: Orca
programVersion: 5.0.3
elementType: C H C H C C C H H C H H C C H H H H H H H
charge: 1
multiplicity: 1
keywords: DSD-PBEP86 def2-TZVP RIJCOSX verytightscf def2-TZVP/C def2/J soscf noTRAH
formula: C8H13
InChI: InChI=1/C8H13/c1-2-4-6-8-7-5-3-1/h1-2,7H,3-6,8H2
21 atoms
C  -2.000738 0.730318 0.078921
H  -2.199462 0.869744 1.145226
C  -1.75565 -0.933399 -0.145394
H  -2.618636 -1.353864 0.375991
C  -0.428354 -1.361938 0.406821
C  0.696382 -1.284647 -0.365152
C  2.008077 -0.687227 0.069193
H  2.221267 -0.878634 1.126457
H  2.859091 -1.023406 -0.527376
C  1.800251 0.894048 -0.144611
H  1.858702 1.132068 -1.211881
H  2.613203 1.424268 0.355752
C  0.423937 1.265748 0.444152
C  -0.748253 1.319449 -0.373556
H  0.530491 -1.21103 -1.444513
H  -1.848183 -1.125879 -1.216163
H  0.091483 0.238387 0.833051
H  -0.613855 1.369678 -1.458239
H  -2.870311 0.989498 -0.525767
H  0.375466 1.775262 1.416772
H  -0.347237 -1.517468 1.484676
totalener: -311.09967620 hartree
nucrepener: 381.04862763 hartree
electener: -692.14830383 hartree
oneelecener: -1162.32637034 hartree
twoeener: 470.17806651 hartree
kineticenergy: 309.95211270 hartree
exchangeener: -12.751313122800 hartree
correlationener: -0.946233380743 hartree
xcener: -13.697546503543 hartree
chargesum: 1.0000000
charge: -0.229516 0.183558 -0.269788 0.191652 -0.117252 -0.128085 -0.200049 0.159528 0.169982 -0.319174 0.165608 0.175855 -0.045662 0.050424 0.146862 0.180610 0.073669 0.197324 0.192985 0.231291 0.190175
charge: -0.177257 0.159926 -0.157329 0.158458 -0.203612 -0.099516 -0.207947 0.148911 0.148775 -0.198532 0.144011 0.151115 -0.211665 0.116483 0.153003 0.151443 0.252913 0.171465 0.158856 0.185886 0.154612
qa: -0.2295 0.1836 -0.2698 0.1917 -0.1173 -0.1281 -0.2000 0.1595 0.1700 -0.3192 0.1656 0.1759 -0.0457 0.0504 0.1469 0.1806 0.0737 0.1973 0.1930 0.2313 0.1902
va: 3.8326 0.9670 3.9403 0.9587 3.6891 3.9291 3.8369 0.9720 0.9718 3.9532 0.9645 0.9705 3.5728 3.7042 0.9665 0.9624 1.1001 0.9492 0.9638 0.9463 0.9589
total: -311.792014819 hartree
energy: -311.792014818610
dipole: 0.04878 -0.68775 -0.63897 0.64586 0.24019 0.88605 0.33199 -0.43455 -0.10256
magnitude: 1.09722 au
magnitude: 2.78890 debye
