program: Gaussian 09
title: 000050959
version: EM64L-G09RevD.01
frameworkgroup: C1[X(C14H12S)]
method: RPBEPBE
basis: SDD
operation: Freq
keyword: #pfreq=noraman
keyword: PBEPBE/SDD
title: #p freq=noraman PBEPBE/SDD
converged: YES YES NO NO
title: Mulliken charges:
elementType: S C C C C C C C C C C C C C C H H H H H H H H H H H H
charge: 0.228823 0.455037 0.455026 -0.374346 -0.374340 -0.568649 -0.568609 0.468721 0.468715 -0.298076 -0.298071 -0.372227 -0.372262 -0.820567 -0.820566 0.235551 0.235551 0.242065 0.242065 0.232529 0.232530 0.230601 0.224579 0.230370 0.224580 0.230780 0.230190
chargesum: 0.00000
title: Mulliken charges with hydrogens summed into heavy atoms:
elementType: S C C C C C C C C C C C C C C
charge: 0.228823 0.455037 0.455026 -0.374346 -0.374340 -0.333098 -0.333057 0.468721 0.468715 -0.056011 -0.056006 -0.139698 -0.139733 -0.135016 -0.135016
polarizability: 2.65711707e+02 -1.16883979e-04 1.80700960e+02 7.07983203e-03 1.77435858e-03 7.27568061e+01
1716.lowfreq: -0.0016 0.0012 0.0022 2.2386 4.7554 6.9749 41.2491 41.9976 89.2937
frequency: 41.2479 41.9932 89.2934 95.3511 142.7482 144.2343 232.8431 285.2191 308.7994 310.0505 352.0563 366.6511 375.8956 428.2175 442.6590 474.7649 490.5750 529.9375 607.9283 616.4269 619.4041 647.5189 712.6898 724.1521 758.7385 795.7066 813.8928 814.6948 891.7685 897.7149 912.5507 954.4631 955.3475 985.2995 1003.4372 1013.6440 1046.1701 1048.4728 1049.1886 1075.1462 1153.1470 1155.1512 1177.9889 1214.4007 1243.9735 1273.1273 1307.7347 1363.2843 1380.6854 1399.9297 1400.4057 1406.6952 1437.2179 1457.4440 1469.9156 1470.5042 1470.7550 1476.9447 1487.2992 1567.5813 1572.6241 1610.9903 1619.7840 2976.1440 2976.3721 3053.6348 3053.6997 3084.4061 3084.5207 3124.1053 3124.8875 3126.4992 3128.5494 3154.8567 3155.1470
redmass: 1.0369 1.0414 3.2975 4.1402 3.8100 4.8373 3.6512 3.0313 4.4654 4.7397 3.2448 6.3959 9.5380 3.0182 2.8447 6.6031 3.9973 3.5960 3.4192 6.9694 5.9691 6.5553 6.5129 3.9243 3.4050 5.8927 1.3211 1.3279 1.3471 1.6128 3.1592 1.3394 1.3478 1.5949 1.5029 3.9006 6.1670 1.5496 1.5492 2.1005 1.3821 1.5195 1.9297 2.5257 1.6876 1.4204 1.9314 3.8627 5.4521 1.2493 1.2664 4.4894 2.7463 2.4664 2.3874 1.0454 1.0455 1.1943 1.4973 5.9789 6.8252 6.6352 6.4025 1.0374 1.0374 1.0977 1.0977 1.0985 1.0985 1.0894 1.0885 1.0904 1.0909 1.0962 1.0963
irintensity: 0.8470 0.1546 0.0000 1.9963 0.8579 0.7146 0.0000 1.3185 0.0002 0.5582 0.0001 3.1985 2.0778 9.6229 0.0000 0.5838 0.6776 26.5635 0.0002 0.1857 0.5866 10.8347 0.6888 0.7337 0.0000 0.0422 84.7200 0.0004 12.0640 0.0004 0.0108 0.8759 0.0003 1.5467 0.3716 43.6845 14.6246 0.0240 24.7731 1.0789 14.4434 0.5231 5.5585 1.7181 8.3212 0.0006 2.0810 5.7954 0.5392 9.0588 12.3541 0.0020 17.1114 25.2829 60.5420 0.0572 25.7661 2.1165 15.4161 3.3288 0.2952 2.1956 1.8441 52.2833 39.2416 4.2701 38.8376 13.7304 20.2495 16.3473 0.4016 5.1224 24.8662 24.2806 8.7296
temp: 298.150 k
press: 1.00000 atm
elementType: 16 6 6 6 6 6 6 6 6 6 6 6 6 6 6 1 1 1 1 1 1 1 1 1 1 1 1
symmnumber: 1
zpe: 557802.5 jmol-1
zpe.correction: 0.212456 hartree
zpe.thermalcorrener: 0.225640 hartree
zpe.thermalcorrenthalpy: 0.226584 hartree
zpe.thermalcorrgfe: 0.171754 hartree
zpe.sumelectzpe: -937.745103 hartree
zpe.sumelectthermal: -937.731919 hartree
zpe.sumelectthermalent: -937.730975 hartree
zpe.sumelectthermalfe: -937.785805 hartree
dipole: -0.0001 1.6599 0.0064
dipole: 1.6599
quadrupole: -77.3141 -87.8362 -101.5933
quadrupole: 0.0000 0.0062 0.0076
quadrupole: 11.6005 1.0783 -12.6788 0.0000 0.0062 0.0076
hfenergy: -937.957559 hartree
pointgroup: C01 [X(C14H12S1)]
dipole: 0.0000308 0.652889 0.0153879 debye
polarizability: 265.7117059|-0.0005791|180.6200437|-0.0180372|2.9542973|72.8377236 unknown
InChI: InChI=1S/C14H12S/c1-9-3-5-13-11(7-9)12-8-10(2)4-6-14(12)15-13/h3-8H,1-2H3
charge 0 multiplicity 1
27 atoms
S  -0.000024 -2.575023 -0.083365
C  0.73202 0.036048 -0.010495
C  -0.731991 0.036064 -0.010278
C  1.282805 -1.279353 -0.047499
C  -1.282813 -1.279327 -0.047097
C  1.617867 1.14399 0.020308
C  -1.617802 1.14402 0.020952
C  3.016623 0.954415 0.014375
C  -3.016564 0.954473 0.015446
C  2.674173 -1.497368 -0.053934
C  -2.674187 -1.497318 -0.052954
C  3.529082 -0.376495 -0.022825
C  -3.529063 -0.376428 -0.021471
C  3.971087 2.136139 0.044643
C  -3.970991 2.136242 0.045071
H  1.211179 2.161976 0.04914
H  -1.211086 2.161996 0.04977
H  3.088314 -2.510245 -0.082099
H  -3.088357 -2.510192 -0.080809
H  4.615011 -0.530991 -0.027135
H  -4.614996 -0.530899 -0.025219
H  4.622567 2.149726 -0.849608
H  3.427258 3.095657 0.077458
H  4.634909 2.095338 0.928826
H  -3.427262 3.095414 0.088083
H  -4.614974 2.15542 -0.854544
H  -4.642187 2.090221 0.92336
