program: Orca
programVersion: 5.0.3
elementType: C H C H C C C H H C H H C C H H H H H H H
charge: 1
multiplicity: 1
keywords: b3lyp def2-TZVP EnGrad RIJCOSX verytightscf def2/J soscf
formula: C8H13
InChI: InChI=1/C8H13/c1-2-4-6-8-7-5-3-1/h1-2,7H,3-6,8H2
21 atoms
C  -1.991644 0.551619 0.111363
H  -2.167263 0.736888 1.175317
C  -1.894171 -0.979101 -0.174804
H  -2.667728 -1.546685 0.347919
C  -0.480282 -1.231613 0.313443
C  0.62812 -1.185424 -0.476805
C  1.919107 -0.674972 0.071524
H  2.047364 -0.948822 1.124104
H  2.786173 -1.039554 -0.487688
C  1.855221 0.882524 -0.067523
H  1.930695 1.154882 -1.127077
H  2.705785 1.344627 0.441362
C  0.527533 1.468622 0.506718
C  -0.612434 1.002721 -0.297868
H  0.532515 -1.306699 -1.555977
H  -1.977917 -1.176481 -1.24823
H  0.395221 1.260623 1.57244
H  -0.480915 1.123998 -1.376919
H  -2.772631 1.04612 -0.477621
H  0.592892 2.5663 0.386174
H  -0.340093 -1.204565 1.395707
totalener: -312.24291868 hartree
nucrepener: 382.50927024 hartree
electener: -694.75218892 hartree
oneelecener: -1166.01943467 hartree
twoeener: 471.26724576 hartree
kineticenergy: 310.53290140 hartree
exchangeener: -36.330484017306 hartree
correlationener: -2.305856027176 hartree
xcener: -38.636340044482 hartree
chargesum: 1.0000000
charge: -0.186735 0.156144 -0.191129 0.165550 -0.076140 -0.075116 -0.209206 0.148889 0.161679 -0.218144 0.144498 0.163113 -0.148049 0.000800 0.170768 0.150820 0.146928 0.185896 0.168153 0.184219 0.157063
charge: -0.200988 0.157492 -0.195515 0.152275 -0.065942 -0.083391 -0.213716 0.154767 0.160212 -0.201869 0.149106 0.153665 -0.219906 0.096677 0.160379 0.154723 0.156824 0.170400 0.160676 0.191700 0.162433
qa: -0.1867 0.1561 -0.1911 0.1656 -0.0761 -0.0751 -0.2092 0.1489 0.1617 -0.2181 0.1445 0.1631 -0.1480 0.0008 0.1708 0.1508 0.1469 0.1859 0.1682 0.1842 0.1571
va: 3.8476 0.9708 3.8348 0.9705 3.8175 3.8083 3.8873 0.9689 0.9699 3.8489 0.9687 0.9646 3.8614 3.6431 0.9610 0.9733 0.9741 0.9513 0.9689 0.9602 0.9660
energy: -312.242918678730
dipole: 0.54736 -0.82941 -0.28205 1.88215 -1.32810 0.55405 0.15866 -0.28532 -0.12665
magnitude: 0.63448 au
magnitude: 1.61273 debye
