program: Orca
programVersion: 5.0.3
elementType: C H C H C C C H H C H H C C H H H H H H H
charge: 1
multiplicity: 1
keywords: m062x cc-pVTZ EnGrad RIJCOSX verytightscf cc-pVTZ/C def2/J soscf
formula: C8H13
InChI: InChI=1/C8H13/c1-2-4-6-8-7-5-3-1/h1-2,7H,3-6,8H2
21 atoms
C  -2.002446 0.700915 0.072661
H  -2.176429 0.794584 1.148755
C  -1.751422 -0.967389 -0.171501
H  -2.627607 -1.382707 0.333662
C  -0.410732 -1.370595 0.378728
C  0.673393 -1.266852 -0.401749
C  1.983865 -0.707338 0.066288
H  2.179033 -0.930674 1.120421
H  2.845708 -1.038159 -0.521493
C  1.796276 0.831125 -0.123533
H  1.82986 1.093128 -1.186956
H  2.605556 1.377526 0.368249
C  0.438112 1.337379 0.49934
C  -0.753246 1.270249 -0.339465
H  0.515058 -1.192726 -1.482114
H  -1.832315 -1.140808 -1.246707
H  0.257377 0.901111 1.483863
H  -0.655054 1.628224 -1.369036
H  -2.868236 0.991594 -0.523825
H  0.560798 2.434492 0.646493
H  -0.316668 -1.444179 1.461748
totalener: -312.27681459 hartree
nucrepener: 379.09690709 hartree
electener: -691.37372168 hartree
oneelecener: -1158.97120548 hartree
twoeener: 467.59748380 hartree
kineticenergy: 310.02285476 hartree
xcener: -23.082235319064 hartree
chargesum: 1.0000000
charge: -0.319445 0.223416 -0.283312 0.202173 -0.167690 -0.134693 -0.300098 0.183324 0.185163 -0.280844 0.181696 0.189336 -0.280032 0.108930 0.186141 0.203247 0.190797 0.268568 0.203216 0.231464 0.208643
charge: 0.120970 0.014988 0.150694 0.004215 0.028938 0.047602 0.068867 -0.002010 0.000908 0.108981 -0.008797 0.000458 0.081017 0.330662 -0.016978 -0.000914 0.006815 0.025098 0.007917 0.051813 -0.021245
qa: -0.3194 0.2234 -0.2833 0.2022 -0.1677 -0.1347 -0.3001 0.1833 0.1852 -0.2808 0.1817 0.1893 -0.2800 0.1089 0.1861 0.2032 0.1908 0.2686 0.2032 0.2315 0.2086
va: 3.7377 0.9432 3.7697 0.9511 3.6210 3.6536 3.7753 0.9608 0.9597 3.7273 0.9559 0.9531 3.7531 3.3229 0.9572 0.9508 0.9651 0.9183 0.9604 0.9435 0.9523
energy: -312.276814585026
dipole: 0.29693 -1.07225 -0.77532 1.95807 -0.61997 1.33810 0.21821 -0.36522 -0.14701
magnitude: 1.55346 au
magnitude: 3.94858 debye
