program: Orca
programVersion: 5.0.3
elementType: C H C H C C C H H C H H C C H H H H H H H
charge: 1
multiplicity: 1
keywords: DSD-PBEP86/2013 def2-TZVP RIJCOSX verytightscf def2-TZVP/C def2/J soscf noTRAH
formula: C8H13
InChI: InChI=1/C8H13/c1-3-7-5-2-6-8(4-1)9-7/h3,6-8H,1-2,4-5H2
21 atoms
C  -2.004489 0.685971 0.093471
H  -2.213194 0.874599 1.150843
C  -1.804866 -0.922285 -0.135969
H  -2.631775 -1.422092 0.371575
C  -0.442721 -1.335355 0.406378
C  0.696532 -1.276785 -0.362389
C  2.00832 -0.680227 0.083333
H  2.220132 -0.880783 1.138033
H  2.854969 -1.012905 -0.51988
C  1.814257 0.917874 -0.136052
H  1.883617 1.139986 -1.205749
H  2.631446 1.430173 0.374879
C  0.440591 1.30871 0.41045
C  -0.706802 1.298786 -0.355983
H  0.53433 -1.213088 -1.442606
H  -1.87862 -1.133335 -1.207359
H  0.007073 0.015278 0.257548
H  -0.557545 1.276627 -1.439455
H  -2.858761 1.007545 -0.504643
H  0.342315 1.391779 1.496137
H  -0.344094 -1.437834 1.489718
totalener: -311.10209988 hartree
nucrepener: 382.71511924 hartree
electener: -693.81721912 hartree
oneelecener: -1165.36398935 hartree
twoeener: 471.54677023 hartree
kineticenergy: 309.93317748 hartree
exchangeener: -12.751735479897 hartree
correlationener: -0.949516925101 hartree
xcener: -13.701252404998 hartree
chargesum: 1.0000000
charge: -0.219381 0.166594 -0.259432 0.183623 -0.127965 -0.040343 -0.221169 0.164997 0.180424 -0.262616 0.169669 0.182906 -0.117702 -0.039689 0.161469 0.170515 0.185298 0.166056 0.181575 0.189314 0.185858
charge: -0.193509 0.151526 -0.191206 0.153912 -0.147311 -0.068112 -0.195779 0.150971 0.153922 -0.192371 0.149951 0.153385 -0.149567 -0.052776 0.163453 0.150229 0.316978 0.164363 0.154470 0.164869 0.162603
qa: -0.2194 0.1666 -0.2594 0.1836 -0.1280 -0.0403 -0.2212 0.1650 0.1804 -0.2626 0.1697 0.1829 -0.1177 -0.0397 0.1615 0.1705 0.1853 0.1661 0.1816 0.1893 0.1859
va: 3.8682 0.9712 3.9309 0.9672 3.7821 3.8714 3.8742 0.9711 0.9672 3.9347 0.9675 0.9680 3.7530 3.8835 0.9657 0.9676 1.0157 0.9636 0.9667 0.9613 0.9622
total: -311.798789850 hartree
energy: -311.798789849722
dipole: -0.00945 -0.02771 -0.03715 0.03412 0.02365 0.05777 -0.03816 -0.00789 -0.04605
magnitude: 0.08269 au
magnitude: 0.21018 debye
