program: Orca
programVersion: 5.0.3
elementType: C H C H C C C H H C H H C C H H H H H H H
charge: 1
multiplicity: 1
keywords: b3lyp def2-TZVP EnGrad RIJCOSX verytightscf def2/J soscf
formula: C8H13
InChI: InChI=1/C8H13/c1-2-4-6-8-7-5-3-1/h1-2,7H,3-6,8H2
21 atoms
C  -2.003025 0.738699 0.069816
H  -2.169705 0.806221 1.147825
C  -1.73502 -0.975447 -0.167607
H  -2.621236 -1.347979 0.351131
C  -0.41047 -1.38299 0.385562
C  0.679651 -1.269789 -0.391034
C  1.993578 -0.702335 0.063569
H  2.195041 -0.915846 1.118673
H  2.851588 -1.03786 -0.525997
C  1.789247 0.836024 -0.130288
H  1.822142 1.099763 -1.19328
H  2.595381 1.386154 0.362362
C  0.428567 1.303197 0.497555
C  -0.763707 1.286632 -0.352572
H  0.515814 -1.188527 -1.470242
H  -1.828479 -1.13776 -1.242397
H  0.230332 0.794153 1.443702
H  -0.658574 1.63751 -1.383187
H  -2.879063 0.997215 -0.524189
H  0.525597 2.383036 0.750468
H  -0.322497 -1.465842 1.468071
totalener: -312.21661852 hartree
nucrepener: 379.08239171 hartree
electener: -691.29901023 hartree
oneelecener: -1159.26274964 hartree
twoeener: 467.96373941 hartree
kineticenergy: 310.53365347 hartree
exchangeener: -36.318665592061 hartree
correlationener: -2.303072479308 hartree
xcener: -38.621738071369 hartree
chargesum: 1.0000000
charge: -0.231616 0.186332 -0.201507 0.182784 -0.170513 -0.066655 -0.204228 0.144250 0.154441 -0.250001 0.146977 0.160220 -0.126757 0.087204 0.124250 0.177793 0.147617 0.203661 0.182908 0.197374 0.155466
charge: -0.160080 0.171670 -0.118216 0.160499 -0.176593 -0.122998 -0.219277 0.151121 0.152075 -0.199855 0.146275 0.154050 -0.201000 0.100614 0.152329 0.154445 0.165469 0.172802 0.160521 0.206756 0.149392
qa: -0.2316 0.1863 -0.2015 0.1828 -0.1705 -0.0667 -0.2042 0.1442 0.1544 -0.2500 0.1470 0.1602 -0.1268 0.0872 0.1242 0.1778 0.1476 0.2037 0.1829 0.1974 0.1555
va: 3.8615 0.9595 3.8120 0.9579 3.8258 3.7965 3.8625 0.9709 0.9720 3.8957 0.9667 0.9650 3.7842 3.5796 0.9695 0.9602 0.9904 0.9480 0.9664 0.9518 0.9686
energy: -312.216618520111
dipole: 0.24005 -1.06420 -0.82416 1.88234 -0.67255 1.20980 0.28364 -0.41432 -0.13068
magnitude: 1.46967 au
magnitude: 3.73559 debye
