program: Orca
programVersion: 5.0.3
elementType: C H C H C C C H H C H H C C H H H H H H H
charge: 1
multiplicity: 1
keywords: b3lyp cc-pVTZ EnGrad D3BJ RIJCOSX verytightscf cc-pVTZ/C def2/J soscf
formula: C8H13
InChI: InChI=1/C8H13/c1-2-4-6-8-7-5-3-1/h1-2,7H,3-6,8H2
21 atoms
C  -1.995592 0.536343 0.119336
H  -2.171866 0.725874 1.18184
C  -1.935381 -0.990846 -0.172773
H  -2.673747 -1.577128 0.377426
C  -0.505408 -1.171988 0.291231
C  0.616344 -1.144995 -0.495929
C  1.91024 -0.659857 0.068043
H  2.018524 -0.951448 1.118126
H  2.770736 -1.042938 -0.487654
C  1.880502 0.902986 -0.0461
H  1.98767 1.187981 -1.099487
H  2.731187 1.33338 0.489063
C  0.548584 1.48073 0.496225
C  -0.569224 0.884104 -0.275686
H  0.533183 -1.306675 -1.570344
H  -2.03979 -1.19383 -1.242933
H  0.426623 1.333614 1.573945
H  -0.435906 0.949794 -1.358518
H  -2.736858 1.082477 -0.473926
H  0.54894 2.568487 0.310565
H  -0.35808 -1.124046 1.371663
totalener: -312.24720277 hartree
nucrepener: 384.43807379 hartree
electener: -696.68527657 hartree
oneelecener: -1169.77534240 hartree
twoeener: 473.09006583 hartree
kineticenergy: 309.99538717 hartree
exchangeener: -36.317195879880 hartree
correlationener: -2.307742583003 hartree
xcener: -38.624938462883 hartree
chargesum: 1.0000000
charge: -0.163332 0.141656 -0.169457 0.153387 -0.048603 -0.056955 -0.185478 0.134855 0.153847 -0.188526 0.131147 0.152630 -0.166053 -0.018108 0.184784 0.137812 0.137009 0.180088 0.154545 0.171276 0.163476
charge: 0.095835 -0.000718 0.100073 -0.002105 0.125936 0.143726 0.083012 -0.000426 0.005456 0.102773 -0.007209 -0.001312 0.069898 0.257424 -0.004343 -0.001305 -0.001045 0.002419 0.002124 0.027527 0.002262
qa: -0.1633 0.1417 -0.1695 0.1534 -0.0486 -0.0570 -0.1855 0.1349 0.1538 -0.1885 0.1311 0.1526 -0.1661 -0.0181 0.1848 0.1378 0.1370 0.1801 0.1545 0.1713 0.1635
va: 3.8235 0.9913 3.8402 0.9832 3.7711 3.7685 3.8736 0.9911 0.9832 3.8378 0.9882 0.9804 3.8502 3.6520 0.9785 0.9931 0.9913 0.9870 0.9815 0.9750 0.9927
dispcorr: -0.036154520 hartree
energy: -312.283357293838
dipole: 0.56285 -0.76127 -0.19842 1.85862 -1.59823 0.26038 0.17767 -0.31628 -0.13861
magnitude: 0.35550 au
magnitude: 0.90361 debye
