program: Orca
programVersion: 5.0.3
elementType: C H C H C C C H H C H H C C H H H H H H H
charge: 1
multiplicity: 1
keywords: DSD-PBEP86/2013 def2-TZVP D3BJ RIJCOSX verytightscf def2-TZVP/C def2/J soscf noTRAH
formula: C8H13
InChI: InChI=1/C8H13/c1-2-4-6-8-7-5-3-1/h1-2,7H,3-6,8H2
21 atoms
C  -1.997597 0.758467 0.071335
H  -2.165969 0.839453 1.148032
C  -1.732194 -0.960571 -0.155077
H  -2.618367 -1.316292 0.375022
C  -0.419301 -1.384283 0.39518
C  0.688008 -1.27887 -0.374111
C  2.002897 -0.6898 0.063608
H  2.212545 -0.883932 1.121154
H  2.856642 -1.03254 -0.526655
C  1.791057 0.866481 -0.142686
H  1.837651 1.123238 -1.206525
H  2.595788 1.412246 0.356606
C  0.421678 1.255266 0.482487
C  -0.767054 1.305825 -0.377363
H  0.524083 -1.206872 -1.454007
H  -1.836727 -1.124015 -1.228095
H  0.173868 0.508873 1.246443
H  -0.656648 1.55299 -1.436767
H  -2.88058 0.987655 -0.523847
H  0.448727 2.177833 1.094674
H  -0.339066 -1.49357 1.476637
totalener: -311.11789190 hartree
nucrepener: 379.70033381 hartree
electener: -690.81822572 hartree
oneelecener: -1159.82265637 hartree
twoeener: 469.00443065 hartree
kineticenergy: 310.01420293 hartree
exchangeener: -14.120441124411 hartree
correlationener: -0.943392888794 hartree
xcener: -15.063834013205 hartree
chargesum: 1.0000000
charge: -0.268234 0.199140 -0.201647 0.193795 -0.207293 -0.108960 -0.214327 0.155500 0.165649 -0.276833 0.153320 0.169035 -0.139531 0.103351 0.140636 0.186208 0.144600 0.212186 0.195926 0.221687 0.175792
charge: -0.167125 0.167910 -0.116290 0.158896 -0.192845 -0.118348 -0.213131 0.148128 0.147411 -0.201733 0.141381 0.150302 -0.212635 0.150751 0.150887 0.152950 0.181520 0.173161 0.158317 0.191794 0.148701
qa: -0.2682 0.1991 -0.2016 0.1938 -0.2073 -0.1090 -0.2143 0.1555 0.1656 -0.2768 0.1533 0.1690 -0.1395 0.1034 0.1406 0.1862 0.1446 0.2122 0.1959 0.2217 0.1758
va: 3.8680 0.9589 3.8405 0.9565 3.8351 3.8591 3.8672 0.9717 0.9739 3.9089 0.9690 0.9694 3.7395 3.5559 0.9681 0.9593 1.0079 0.9463 0.9647 0.9413 0.9621
total: -311.773474008 hartree
dispcorr: -0.014258974 hartree
energy: -311.787732982206
dipole: 0.14222 -1.05240 -0.91017 1.44662 -0.25091 1.19571 0.41460 -0.57714 -0.16254
magnitude: 1.51148 au
magnitude: 3.84187 debye
