program: Orca
programVersion: 5.0.3
elementType: C H C H C C C H H C H H C C H H H H H H H
charge: 1
multiplicity: 1
keywords: PBE0 cc-pVTZ EnGrad RIJCOSX verytightscf cc-pVTZ/C def2/J soscf
formula: C8H13
InChI: InChI=1/C8H13/c1-2-4-6-8-7-5-3-1/h1-2,7H,3-6,8H2
21 atoms
C  -1.998823 0.759882 0.070097
H  -2.162407 0.831319 1.148069
C  -1.730077 -0.966628 -0.158198
H  -2.618389 -1.317776 0.371101
C  -0.416526 -1.386741 0.393002
C  0.68618 -1.27636 -0.377526
C  2.001413 -0.69183 0.062897
H  2.209523 -0.889387 1.120035
H  2.855864 -1.034151 -0.526869
C  1.78916 0.858004 -0.140365
H  1.830832 1.118468 -1.203623
H  2.59301 1.406508 0.357579
C  0.421924 1.261533 0.488959
C  -0.767777 1.301036 -0.373424
H  0.521648 -1.20174 -1.457183
H  -1.834153 -1.126926 -1.231714
H  0.188852 0.58111 1.313954
H  -0.659063 1.588678 -1.422817
H  -2.882524 0.991684 -0.522719
H  0.468109 2.247142 0.997338
H  -0.335232 -1.487251 1.474839
totalener: -312.03040991 hartree
nucrepener: 379.49341122 hartree
electener: -691.52382113 hartree
oneelecener: -1160.00510265 hartree
twoeener: 468.48128152 hartree
kineticenergy: 309.64711336 hartree
exchangeener: -34.146548265963 hartree
correlationener: -1.960829380096 hartree
xcener: -36.107377646059 hartree
chargesum: 1.0000000
charge: -0.204948 0.176566 -0.181780 0.174155 -0.144631 -0.096537 -0.172149 0.133566 0.146420 -0.199659 0.136723 0.150419 -0.203028 0.109910 0.140023 0.168487 0.142606 0.200533 0.178784 0.189183 0.155357
charge: 0.131380 0.014377 0.173474 0.008124 0.018197 0.072993 0.074695 -0.003206 -0.002404 0.105567 -0.010809 -0.000130 0.077520 0.299221 -0.015127 -0.000252 0.009397 0.016153 0.006418 0.045633 -0.021220
qa: -0.2049 0.1766 -0.1818 0.1742 -0.1446 -0.0965 -0.1721 0.1336 0.1464 -0.1997 0.1367 0.1504 -0.2030 0.1099 0.1400 0.1685 0.1426 0.2005 0.1788 0.1892 0.1554
va: 3.8597 0.9813 3.8828 0.9776 3.8169 3.8305 3.8846 0.9950 0.9884 3.8702 0.9932 0.9864 3.8821 3.5731 0.9942 0.9824 1.0117 0.9756 0.9829 0.9769 0.9952
energy: -312.030409913149
dipole: 0.16485 -1.02030 -0.85545 1.59914 -0.51003 1.08911 0.39145 -0.50182 -0.11037
magnitude: 1.38930 au
magnitude: 3.53131 debye
