program: Orca
programVersion: 5.0.3
elementType: C H C H C C C H H C H H C C H H H H H H H
charge: 1
multiplicity: 1
keywords: DSD-PBEP86/2013 cc-pVTZ EnGrad D3BJ RIJCOSX verytightscf cc-pVTZ/C def2/J soscf
formula: C8H13
InChI: InChI=1/C8H13/c1-2-4-6-8-7-5-3-1/h1-2,7H,3-6,8H2
21 atoms
C  -1.990054 0.575349 0.095461
H  -2.166869 0.75438 1.161619
C  -1.848632 -0.965627 -0.173966
H  -2.656941 -1.508096 0.324161
C  -0.45304 -1.285713 0.340046
C  0.642879 -1.223973 -0.451261
C  1.935482 -0.690686 0.072676
H  2.089711 -0.945078 1.126489
H  2.804098 -1.036618 -0.497383
C  1.83277 0.860538 -0.091529
H  1.883283 1.122486 -1.154874
H  2.673758 1.356827 0.401119
C  0.498557 1.438219 0.511517
C  -0.662231 1.121962 -0.315809
H  0.527869 -1.283846 -1.534836
H  -1.913412 -1.162243 -1.24905
H  0.355978 1.150183 1.556143
H  -0.554564 1.365128 -1.377673
H  -2.806075 1.008187 -0.493693
H  0.620811 2.539222 0.470826
H  -0.324589 -1.298607 1.423709
totalener: -311.14615652 hartree
nucrepener: 380.83062966 hartree
electener: -691.97678618 hartree
oneelecener: -1162.04077173 hartree
twoeener: 470.06398556 hartree
kineticenergy: 309.72446561 hartree
exchangeener: -14.120237130387 hartree
correlationener: -0.943636669055 hartree
xcener: -15.063873799443 hartree
chargesum: 1.0000000
charge: -0.224620 0.178115 -0.227785 0.181188 -0.126973 -0.146609 -0.237622 0.163313 0.179330 -0.243936 0.156673 0.181383 -0.231239 0.044070 0.199796 0.165749 0.171976 0.231781 0.186210 0.210365 0.188836
charge: 0.090654 0.007113 0.093019 -0.000130 0.096451 0.075416 0.071644 -0.001611 0.005239 0.109477 -0.007767 -0.000515 0.071792 0.344386 -0.013338 -0.000082 0.003845 0.015796 0.009134 0.041235 -0.011758
qa: -0.2246 0.1781 -0.2278 0.1812 -0.1270 -0.1466 -0.2376 0.1633 0.1793 -0.2439 0.1567 0.1814 -0.2312 0.0441 0.1998 0.1657 0.1720 0.2318 0.1862 0.2104 0.1888
va: 3.8556 0.9802 3.9005 0.9746 3.8320 3.8409 3.9080 0.9855 0.9770 3.8813 0.9833 0.9724 3.9087 3.5661 0.9723 0.9854 0.9849 0.9563 0.9761 0.9654 0.9804
dispcorr: -0.014237191 hartree
energy: -311.831610095176
dipole: 0.49948 -0.91580 -0.41633 1.93027 -0.99416 0.93611 0.14651 -0.28066 -0.13415
magnitude: 1.03326 au
magnitude: 2.62634 debye
