program: Orca
programVersion: 5.0.3
elementType: C H C H C C C H H C H H C C H H H H H H H
charge: 1
multiplicity: 1
keywords: DSD-PBEP86/2013 cc-pVTZ EnGrad D3BJ RIJCOSX verytightscf cc-pVTZ/C def2/J soscf
formula: C8H13
InChI: InChI=1/C8H13/c1-2-4-6-8-7-5-3-1/h1-2,7H,3-6,8H2
21 atoms
C  -2.002287 0.748589 0.069263
H  -2.165995 0.812579 1.147735
C  -1.731773 -0.975169 -0.165306
H  -2.619813 -1.337002 0.357393
C  -0.411445 -1.385725 0.387881
C  0.681712 -1.271167 -0.387058
C  1.996368 -0.699275 0.062917
H  2.199941 -0.908185 1.118588
H  2.853174 -1.036974 -0.526831
C  1.788007 0.84059 -0.133147
H  1.821748 1.104525 -1.196024
H  2.593044 1.391331 0.360572
C  0.425747 1.289644 0.496447
C  -0.765642 1.290842 -0.358668
H  0.516923 -1.190542 -1.466208
H  -1.829139 -1.135363 -1.239803
H  0.219422 0.741716 1.419163
H  -0.658899 1.633695 -1.391646
H  -2.881602 0.99802 -0.523273
H  0.51051 2.35537 0.805363
H  -0.325572 -1.472508 1.470219
totalener: -311.12535975 hartree
nucrepener: 379.16040477 hartree
electener: -690.28576452 hartree
oneelecener: -1158.74990687 hartree
twoeener: 468.46414236 hartree
kineticenergy: 309.73330174 hartree
exchangeener: -14.117529929205 hartree
correlationener: -0.942395284894 hartree
xcener: -15.059925214099 hartree
chargesum: 1.0000000
charge: -0.265304 0.200533 -0.235509 0.198801 -0.158905 -0.126110 -0.234652 0.157265 0.174009 -0.253158 0.157548 0.176830 -0.241676 0.096567 0.163339 0.189657 0.161415 0.237563 0.201638 0.212965 0.187184
charge: 0.132914 0.013818 0.176759 0.005557 0.022565 0.062117 0.072344 -0.004160 -0.002211 0.105512 -0.011335 -0.001319 0.078923 0.310779 -0.017271 -0.001501 0.006044 0.020171 0.005608 0.046932 -0.022247
qa: -0.2653 0.2005 -0.2355 0.1988 -0.1589 -0.1261 -0.2347 0.1573 0.1740 -0.2532 0.1575 0.1768 -0.2417 0.0966 0.1633 0.1897 0.1614 0.2376 0.2016 0.2130 0.1872
va: 3.8820 0.9711 3.9015 0.9659 3.8148 3.8456 3.9020 0.9869 0.9777 3.8859 0.9841 0.9744 3.9100 3.5517 0.9838 0.9726 0.9960 0.9548 0.9738 0.9638 0.9802
dispcorr: -0.014165489 hartree
energy: -311.812646296531
dipole: 0.21888 -1.11205 -0.89316 1.83229 -0.64611 1.18618 0.31390 -0.45307 -0.13917
magnitude: 1.49135 au
magnitude: 3.79071 debye
