program: Orca
programVersion: 5.0.3
elementType: C H C H C C C H H C H H C C H H H H H H H
charge: 1
multiplicity: 1
keywords: PBE0 cc-pVTZ EnGrad RIJCOSX verytightscf cc-pVTZ/C def2/J soscf
formula: C8H13
InChI: InChI=1/C8H13/c1-2-4-6-8-7-5-3-1/h1-2,7H,3-6,8H2
21 atoms
C  -2.003025 0.738699 0.069816
H  -2.169705 0.806221 1.147825
C  -1.73502 -0.975447 -0.167607
H  -2.621236 -1.347979 0.351131
C  -0.41047 -1.38299 0.385562
C  0.679651 -1.269789 -0.391034
C  1.993578 -0.702335 0.063569
H  2.195041 -0.915846 1.118673
H  2.851588 -1.03786 -0.525997
C  1.789247 0.836024 -0.130288
H  1.822142 1.099763 -1.19328
H  2.595381 1.386154 0.362362
C  0.428567 1.303197 0.497555
C  -0.763707 1.286632 -0.352572
H  0.515814 -1.188527 -1.470242
H  -1.828479 -1.13776 -1.242397
H  0.230332 0.794153 1.443702
H  -0.658574 1.63751 -1.383187
H  -2.879063 0.997215 -0.524189
H  0.525597 2.383036 0.750468
H  -0.322497 -1.465842 1.468071
totalener: -312.03699437 hartree
nucrepener: 379.08239171 hartree
electener: -691.11938608 hartree
oneelecener: -1159.20489759 hartree
twoeener: 468.08551151 hartree
kineticenergy: 309.65001738 hartree
exchangeener: -34.148102128796 hartree
correlationener: -1.959814946188 hartree
xcener: -36.107917074985 hartree
chargesum: 1.0000000
charge: -0.201633 0.176905 -0.178337 0.170917 -0.154709 -0.105471 -0.170711 0.135499 0.147220 -0.198381 0.136683 0.150591 -0.193226 0.101348 0.139824 0.166336 0.147304 0.206743 0.177108 0.186291 0.159699
charge: 0.130717 0.014619 0.169675 0.005651 0.021553 0.060341 0.070794 -0.002306 -0.000408 0.106873 -0.009112 0.000374 0.081644 0.303634 -0.015739 -0.000770 0.007939 0.019578 0.006233 0.050918 -0.022208
qa: -0.2016 0.1769 -0.1783 0.1709 -0.1547 -0.1055 -0.1707 0.1355 0.1472 -0.1984 0.1367 0.1506 -0.1932 0.1013 0.1398 0.1663 0.1473 0.2067 0.1771 0.1863 0.1597
va: 3.8522 0.9820 3.8775 0.9789 3.8084 3.8360 3.8812 0.9948 0.9888 3.8700 0.9921 0.9856 3.8966 3.5664 0.9943 0.9834 1.0016 0.9719 0.9848 0.9778 0.9931
energy: -312.036994374425
dipole: 0.24005 -1.05955 -0.81950 1.88234 -0.66521 1.21713 0.28364 -0.41291 -0.12927
magnitude: 1.47299 au
magnitude: 3.74404 debye
