program: Orca
programVersion: 5.0.3
elementType: C H C H C C C H H C H H C C H H H H H H H
charge: 1
multiplicity: 1
keywords: DSD-PBEP86/2013 cc-pVTZ EnGrad D3BJ RIJCOSX verytightscf cc-pVTZ/C def2/J soscf
formula: C8H13
InChI: InChI=1/C8H13/c1-2-4-6-8-7-5-3-1/h1-2,7H,3-6,8H2
21 atoms
C  -1.991967 0.550086 0.112397
H  -2.167536 0.735738 1.176215
C  -1.897903 -0.980129 -0.174738
H  -2.668406 -1.54961 0.350248
C  -0.482538 -1.226605 0.311295
C  0.627026 -1.181937 -0.478726
C  1.918112 -0.673645 0.071317
H  2.044392 -0.949123 1.123718
H  2.784802 -1.039822 -0.487308
C  1.857306 0.884368 -0.065524
H  1.935311 1.157744 -1.12464
H  2.708227 1.343625 0.445285
C  0.529631 1.470319 0.505938
C  -0.608442 0.992196 -0.29605
H  0.53277 -1.307462 -1.557466
H  -1.983427 -1.177711 -1.247957
H  0.39817 1.268407 1.573006
H  -0.475769 1.105616 -1.37572
H  -2.769664 1.049504 -0.476745
H  0.589458 2.56739 0.379143
H  -0.341566 -1.196967 1.393395
totalener: -311.15646544 hartree
nucrepener: 382.67127351 hartree
electener: -693.82773895 hartree
oneelecener: -1165.66730236 hartree
twoeener: 471.83956341 hartree
kineticenergy: 309.72732431 hartree
exchangeener: -14.122241772961 hartree
correlationener: -0.945203282199 hartree
xcener: -15.067445055160 hartree
chargesum: 1.0000000
charge: -0.225543 0.172545 -0.225927 0.182122 -0.094240 -0.118778 -0.243328 0.163242 0.180722 -0.245513 0.156417 0.181725 -0.232110 -0.001497 0.214983 0.165353 0.169960 0.218037 0.184239 0.204735 0.192855
charge: 0.088302 0.002352 0.092087 -0.000599 0.120112 0.113533 0.074872 -0.000504 0.005786 0.101754 -0.006785 -0.000529 0.066127 0.302264 -0.007090 0.000108 0.001774 0.008301 0.006433 0.033973 -0.002272
qa: -0.2255 0.1725 -0.2259 0.1821 -0.0942 -0.1188 -0.2433 0.1632 0.1807 -0.2455 0.1564 0.1817 -0.2321 -0.0015 0.2150 0.1654 0.1700 0.2180 0.1842 0.2047 0.1929
va: 3.8621 0.9832 3.8886 0.9759 3.8198 3.8254 3.9148 0.9850 0.9769 3.8854 0.9827 0.9723 3.9048 3.6462 0.9659 0.9867 0.9832 0.9650 0.9755 0.9661 0.9790
dispcorr: -0.014330691 hartree
energy: -311.843838915749
dipole: 0.54986 -0.84650 -0.29665 1.87905 -1.36146 0.51759 0.16022 -0.29464 -0.13442
magnitude: 0.61153 au
magnitude: 1.55438 debye
