program: Orca
programVersion: 5.0.3
elementType: C H C H C C C H H C H H C C H H H H H H H
charge: 1
multiplicity: 1
keywords: b3lyp def2-TZVP EnGrad RIJCOSX verytightscf def2/J soscf
formula: C8H13
InChI: InChI=1/C8H13/c1-2-4-6-8-7-5-3-1/h1-2,7H,3-6,8H2
21 atoms
C  -2.002287 0.748589 0.069263
H  -2.165995 0.812579 1.147735
C  -1.731773 -0.975169 -0.165306
H  -2.619813 -1.337002 0.357393
C  -0.411445 -1.385725 0.387881
C  0.681712 -1.271167 -0.387058
C  1.996368 -0.699275 0.062917
H  2.199941 -0.908185 1.118588
H  2.853174 -1.036974 -0.526831
C  1.788007 0.84059 -0.133147
H  1.821748 1.104525 -1.196024
H  2.593044 1.391331 0.360572
C  0.425747 1.289644 0.496447
C  -0.765642 1.290842 -0.358668
H  0.516923 -1.190542 -1.466208
H  -1.829139 -1.135363 -1.239803
H  0.219422 0.741716 1.419163
H  -0.658899 1.633695 -1.391646
H  -2.881602 0.99802 -0.523273
H  0.51051 2.35537 0.805363
H  -0.325572 -1.472508 1.470219
totalener: -312.21530224 hartree
nucrepener: 379.16040477 hartree
electener: -691.37570700 hartree
oneelecener: -1159.41647324 hartree
twoeener: 468.04076624 hartree
kineticenergy: 310.53534590 hartree
exchangeener: -36.318511090839 hartree
correlationener: -2.303146240660 hartree
xcener: -38.621657331499 hartree
chargesum: 1.0000000
charge: -0.234459 0.187456 -0.200790 0.184077 -0.172639 -0.063315 -0.206182 0.144788 0.154725 -0.250032 0.146681 0.159847 -0.128065 0.086068 0.124815 0.178737 0.145998 0.202756 0.183701 0.198694 0.157139
charge: -0.158954 0.171562 -0.114774 0.161168 -0.178846 -0.118635 -0.218689 0.151048 0.151611 -0.200926 0.145950 0.153980 -0.202427 0.096454 0.152492 0.154579 0.167045 0.172200 0.160213 0.205470 0.149480
qa: -0.2345 0.1875 -0.2008 0.1841 -0.1726 -0.0633 -0.2062 0.1448 0.1547 -0.2500 0.1467 0.1598 -0.1281 0.0861 0.1248 0.1787 0.1460 0.2028 0.1837 0.1987 0.1571
va: 3.8623 0.9591 3.8109 0.9573 3.8228 3.7964 3.8609 0.9707 0.9723 3.8961 0.9670 0.9655 3.7765 3.5839 0.9694 0.9597 0.9930 0.9493 0.9662 0.9510 0.9682
energy: -312.215302236664
dipole: 0.21888 -1.05718 -0.83830 1.83229 -0.66051 1.17178 0.31390 -0.44186 -0.12796
magnitude: 1.44644 au
magnitude: 3.67655 debye
