program: Orca
programVersion: 5.0.3
elementType: C H C H C C C H H C H H C C H H H H H H H
charge: 1
multiplicity: 1
keywords: DSD-PBEP86/2013 def2-TZVP RIJCOSX verytightscf def2-TZVP/C def2/J soscf noTRAH
formula: C8H13
InChI: InChI=1/C8H13/c1-3-7-5-2-6-8(4-1)9-7/h3,6-8H,1-2,4-5H2
21 atoms
C  -2.006059 0.693082 0.090093
H  -2.216965 0.877812 1.147645
C  -1.795624 -0.920753 -0.137703
H  -2.627612 -1.413372 0.368735
C  -0.438572 -1.337661 0.409471
C  0.698413 -1.278965 -0.361781
C  2.010025 -0.683109 0.080104
H  2.223715 -0.882172 1.134802
H  2.856752 -1.01407 -0.52404
C  1.810261 0.913074 -0.138045
H  1.875462 1.136715 -1.207744
H  2.627565 1.428565 0.369478
C  0.43589 1.302298 0.414539
C  -0.713477 1.305023 -0.357083
H  0.532168 -1.205006 -1.440869
H  -1.869166 -1.131409 -1.209002
H  0.012141 0.036331 0.328806
H  -0.561401 1.275702 -1.440159
H  -2.861274 1.00572 -0.511162
H  0.342798 1.431111 1.496508
H  -0.344604 -1.464587 1.490404
totalener: -311.10056047 hartree
nucrepener: 382.56886149 hartree
electener: -693.66942195 hartree
oneelecener: -1165.10013817 hartree
twoeener: 471.43071622 hartree
kineticenergy: 309.92991227 hartree
exchangeener: -12.751252134525 hartree
correlationener: -0.949287203608 hartree
xcener: -13.700539338133 hartree
chargesum: 1.0000000
charge: -0.218184 0.166976 -0.267647 0.183986 -0.124572 -0.039649 -0.217844 0.163935 0.179677 -0.271904 0.170339 0.182687 -0.110072 -0.024201 0.158414 0.171944 0.161796 0.167427 0.182518 0.195861 0.188512
charge: -0.192561 0.152007 -0.189618 0.154148 -0.158757 -0.065184 -0.197281 0.150927 0.153476 -0.192330 0.149558 0.153191 -0.158915 -0.033524 0.162475 0.150013 0.313765 0.165222 0.154761 0.166524 0.162102
qa: -0.2182 0.1670 -0.2676 0.1840 -0.1246 -0.0396 -0.2178 0.1639 0.1797 -0.2719 0.1703 0.1827 -0.1101 -0.0242 0.1584 0.1719 0.1618 0.1674 0.1825 0.1959 0.1885
va: 3.8618 0.9715 3.9429 0.9670 3.7543 3.8807 3.8683 0.9716 0.9673 3.9459 0.9666 0.9685 3.7118 3.8798 0.9662 0.9667 1.0357 0.9627 0.9662 0.9595 0.9620
total: -311.797491172 hartree
energy: -311.797491172211
dipole: -0.00975 -0.06755 -0.07731 0.07656 0.05877 0.13533 0.00335 -0.05833 -0.05498
magnitude: 0.16527 au
magnitude: 0.42007 debye
