program: Orca
programVersion: 5.0.3
elementType: C H C H C C C H H C H H C C H H H H H H H
charge: 1
multiplicity: 1
keywords: b3lyp def2-TZVP EnGrad D3BJ RIJCOSX verytightscf def2/J soscf
formula: C8H13
InChI: InChI=1/C8H13/c1-3-7-5-2-6-8(4-1)9-7/h3,6-8H,1-2,4-5H2
21 atoms
C  -2.006059 0.693082 0.090093
H  -2.216965 0.877812 1.147645
C  -1.795624 -0.920753 -0.137703
H  -2.627612 -1.413372 0.368735
C  -0.438572 -1.337661 0.409471
C  0.698413 -1.278965 -0.361781
C  2.010025 -0.683109 0.080104
H  2.223715 -0.882172 1.134802
H  2.856752 -1.01407 -0.52404
C  1.810261 0.913074 -0.138045
H  1.875462 1.136715 -1.207744
H  2.627565 1.428565 0.369478
C  0.43589 1.302298 0.414539
C  -0.713477 1.305023 -0.357083
H  0.532168 -1.205006 -1.440869
H  -1.869166 -1.131409 -1.209002
H  0.012141 0.036331 0.328806
H  -0.561401 1.275702 -1.440159
H  -2.861274 1.00572 -0.511162
H  0.342798 1.431111 1.496508
H  -0.344604 -1.464587 1.490404
totalener: -312.18530087 hartree
nucrepener: 382.56886149 hartree
electener: -694.75416236 hartree
oneelecener: -1165.74702746 hartree
twoeener: 470.99286510 hartree
kineticenergy: 310.49507409 hartree
exchangeener: -36.315641530520 hartree
correlationener: -2.308703499229 hartree
xcener: -38.624345029749 hartree
chargesum: 1.0000000
charge: -0.208106 0.156305 -0.253723 0.172834 -0.091757 -0.019996 -0.208437 0.153374 0.168916 -0.256434 0.161033 0.171716 -0.081395 -0.008310 0.145961 0.162918 0.154522 0.153305 0.171248 0.181247 0.174779
charge: -0.193676 0.153959 -0.190030 0.157491 -0.154653 -0.072754 -0.198616 0.152993 0.156247 -0.192865 0.152280 0.156362 -0.155595 -0.050253 0.162887 0.152619 0.310417 0.164726 0.157472 0.167616 0.163372
qa: -0.2081 0.1563 -0.2537 0.1728 -0.0918 -0.0200 -0.2084 0.1534 0.1689 -0.2564 0.1610 0.1717 -0.0814 -0.0083 0.1460 0.1629 0.1545 0.1533 0.1712 0.1812 0.1748
va: 3.8497 0.9692 3.9210 0.9675 3.7145 3.8360 3.8553 0.9695 0.9670 3.9239 0.9657 0.9686 3.6838 3.8402 0.9653 0.9656 1.0046 0.9629 0.9663 0.9596 0.9615
dispcorr: -0.037015979 hartree
energy: -312.222316850176
dipole: -0.00975 -0.05530 -0.06505 0.07656 0.02621 0.10277 0.00335 -0.02476 -0.02140
magnitude: 0.12350 au
magnitude: 0.31390 debye
