program: Gaussian 09
title: 000050961
version: EM64L-G09RevD.01
frameworkgroup: C1[X(C20H11NO2)]
method: RPBEPBE
basis: SDD
operation: Freq
keyword: #p
keyword: freq=noraman
keyword: PBEPBE/SDD
title: #p freq=noraman PBEPBE/SDD
converged: YES YES NO YES
title: Mulliken charges:
elementType: O O N C C C C C C C C C C C C C C C C C C C C H H H H H H H H H H H
charge: -0.217824 -0.227150 0.018634 0.013483 0.051901 0.323349 0.542990 0.296884 0.513598 0.163921 0.464840 -0.807778 -0.442191 -0.507893 -0.523433 -0.427352 0.200643 -0.472410 -0.447289 -0.343560 -0.451855 -0.253641 -0.247468 0.254294 0.230397 0.249146 0.248041 0.310536 0.252197 0.290066 0.225658 0.250389 0.233015 0.235860
chargesum: 0.00000
title: Mulliken charges with hydrogens summed into heavy atoms:
elementType: O O N C C C C C C C C C C C C C C C C C C C C
charge: -0.217824 -0.227150 0.018634 0.013483 0.051901 0.323349 0.542990 0.296884 0.513598 0.163921 0.464840 -0.553484 -0.211793 -0.258747 -0.275392 -0.116816 0.200643 -0.220213 -0.157222 -0.117902 -0.201466 -0.020626 -0.011608
polarizability: 5.31361977e+02 -1.92549726e+01 2.61246357e+02 4.29128288e-03 1.09413033e-02 8.34211949e+01
1716.lowfreq: -15.7828 -9.7878 -4.4322 -0.0011 -0.0006 -0.0005 5.5884 40.4535 80.8447
frequency: -15.7680 40.4495 80.8444 95.9217 152.8098 166.6580 210.9928 238.6553 240.9036 288.6332 297.7866 315.6203 350.4333 386.8405 399.1526 422.6992 466.9469 497.8847 500.2202 507.1420 519.0817 524.4085 554.0408 554.5232 565.8144 593.8450 634.2647 642.9975 677.1391 697.4637 699.6575 715.8825 747.5933 761.9010 771.7528 776.7563 804.0812 817.7756 843.1668 855.5899 860.8610 876.0749 883.0682 926.7030 947.2378 968.0989 981.9391 986.4620 995.6164 998.8167 1014.5520 1029.3514 1050.0813 1117.2541 1129.3652 1157.3694 1158.2723 1177.4884 1181.1296 1186.5156 1202.6407 1216.0862 1250.8038 1269.0432 1290.4283 1315.7684 1324.6483 1343.1945 1384.2616 1396.7667 1402.2434 1414.5284 1417.4657 1432.7105 1446.6173 1471.2132 1475.9631 1500.7856 1519.6225 1560.7423 1586.4557 1594.8462 1608.7784 1622.9311 1629.7498 3123.7936 3127.8173 3133.3338 3134.2056 3138.9093 3145.3729 3155.2095 3166.2687 3172.8376 3191.6232 3216.7673
redmass: 14.3789 7.2328 4.5873 4.7667 4.3605 7.5113 4.4252 4.9176 7.7913 4.3947 8.4080 4.5267 8.4984 6.7959 3.5342 6.9187 3.3304 6.2134 3.6664 5.7877 3.8056 6.9417 6.4133 2.8497 4.2136 7.0100 6.4193 7.2934 5.9510 3.9080 6.6395 3.7212 5.8129 1.2885 8.4353 2.2442 5.8239 1.7180 1.4855 2.3047 4.8336 1.5559 1.8187 6.5968 1.9573 1.4679 1.4039 5.7556 1.3653 1.3612 1.3596 2.8227 3.6224 2.4964 2.2949 1.8896 1.7051 2.7006 1.2819 1.4209 1.6088 1.3356 1.9774 1.8270 2.0156 2.5615 3.6458 4.5316 4.4654 2.6320 5.7699 4.7588 2.4454 3.0620 3.7330 3.9911 3.5390 4.9073 4.1348 6.6231 6.5898 6.3340 6.9053 6.5653 6.8257 1.0914 1.0868 1.0908 1.0884 1.0890 1.0907 1.0949 1.0980 1.0957 1.0940 1.0933
irintensity: 0.0010 0.7734 1.4163 1.6651 1.1853 0.3853 4.2440 3.8817 1.9338 1.0048 1.3756 0.2463 1.0635 0.0103 0.7075 1.0811 5.6757 0.0225 0.1540 1.6508 1.2547 8.1762 3.2993 3.3073 0.7914 0.7917 3.5102 1.0970 2.3333 14.3208 0.5444 3.4096 1.4691 73.9339 27.8626 20.0925 0.8455 0.4269 7.6239 4.7972 0.8660 79.6581 0.5691 9.3464 34.7571 20.0975 0.2275 1.5804 1.5406 0.1160 0.0133 2.0294 15.1105 0.2460 13.0612 125.5543 4.8836 595.8732 98.3860 43.3145 128.9017 15.0837 4.8278 6.0715 21.4545 5.3273 7.7664 35.5923 3.0855 36.1353 21.7743 11.6678 3.7186 13.2594 6.7924 10.5253 3.9878 1.6515 13.9819 10.2845 5.2699 42.4027 18.8120 40.6257 58.9070 3.0163 3.0724 15.3677 0.7447 10.5337 11.5787 14.0474 23.9845 42.9081 4.3520 11.3794
temp: 298.150 k
press: 1.00000 atm
elementType: 8 8 7 6 6 6 6 6 6 6 6 6 6 6 6 6 6 6 6 6 6 6 6 1 1 1 1 1 1 1 1 1 1 1
symmnumber: 1
zpe: 660512.2 jmol-1
zpe.correction: 0.251576 hartree
zpe.thermalcorrener: 0.266437 hartree
zpe.thermalcorrenthalpy: 0.267381 hartree
zpe.thermalcorrgfe: 0.209907 hartree
zpe.sumelectzpe: -972.389503 hartree
zpe.sumelectthermal: -972.374642 hartree
zpe.sumelectthermalent: -972.373698 hartree
zpe.sumelectthermalfe: -972.431172 hartree
dipole: 7.4489 2.3174 -0.0002
dipole: 7.8010
quadrupole: -146.2411 -112.1790 -137.2195
quadrupole: -12.0431 0.0049 -0.0030
quadrupole: -14.3612 19.7008 -5.3396 -12.0431 0.0049 -0.0030
hfenergy: -972.6410792 hartree
pointgroup: C01 [X(C20H11N1O2)]
dipole: -2.9238823 -0.9330912 -0.000095 debye
polarizability: 531.6286497|-17.2815042|260.9796843|-0.0042113|-0.0109723|83.4211949 unknown
InChI: InChI=1S/C20H11NO2/c22-21(23)18-10-7-12-5-8-16-15-4-2-1-3-13(15)11-14-6-9-17(18)19(12)20(14)16/h1-11H
charge 0 multiplicity 1
34 atoms
O  5.77754 0.133336 0.000953
O  4.570783 2.053816 -0.000998
N  4.640779 0.759271 -0.000228
C  -0.395744 0.037292 -0.000076
C  0.968215 -0.437116 -0.000128
C  -1.49942 -0.883527 -0.000016
C  -0.653714 1.465091 -0.000075
C  2.081963 0.500731 -0.000215
C  1.211077 -1.858983 -0.000096
C  -2.865911 -0.380069 0.000042
C  -3.090771 1.052915 0.00005
C  -1.975489 1.939592 -0.00001
C  -1.209387 -2.293103 -0.000003
C  0.470315 2.368843 -0.000133
C  0.095126 -2.762232 -0.000041
C  1.776157 1.920789 -0.000214
C  3.403838 -0.057821 -0.000192
C  2.550934 -2.346793 -0.000104
C  3.626563 -1.462446 -0.000124
C  -4.01557 -1.234809 0.000093
C  -4.432393 1.564487 0.000115
C  -5.312518 -0.711431 0.00015
C  -5.527393 0.7019 0.000164
H  -2.156861 3.021558 -0.000005
H  -2.028561 -3.016971 0.000049
H  0.269405 3.446589 -0.000132
H  0.29489 -3.839498 -0.000019
H  2.603755 2.627401 -0.000316
H  2.727918 -3.427431 -0.000099
H  4.659138 -1.817283 -0.000092
H  -3.891361 -2.321348 0.000081
H  -4.579386 2.650783 0.000122
H  -6.172806 -1.38948 0.000184
H  -6.548012 1.098447 0.000213
