program: Gaussian 09
title: 000006913
version: EM64L-G09RevD.01
frameworkgroup: C1[X(C9H13N)]
method: RPBEPBE
basis: SDD
operation: Freq
keyword: #pfreq=noraman
keyword: PBEPBE/SDD
title: #p freq=noraman PBEPBE/SDD
converged: NO NO NO NO
title: Mulliken charges:
elementType: N C C C C C C C C C H H H H H H H H H H H H H
charge: -0.705569 0.360541 0.360521 0.131841 0.481378 -0.608007 -0.607789 -0.853745 -0.853746 -0.822125 0.227627 0.227624 0.221639 0.221621 0.236665 0.221600 0.221661 0.236663 0.218535 0.218533 0.227525 0.318504 0.318504
chargesum: 0.00000
title: Mulliken charges with hydrogens summed into heavy atoms:
elementType: N C C C C C C C C C
charge: -0.068560 0.360541 0.360521 0.131841 0.481378 -0.380380 -0.380164 -0.173821 -0.173821 -0.157532
polarizability: 1.36270149e+02 -1.65969273e-03 1.19494294e+02 -3.46735321e-01 -2.21120233e-04 5.86999643e+01
1716.lowfreq: -11.7234 -0.0006 -0.0005 -0.0004 8.1067 13.7836 35.6568 114.7508 166.5212
frequency: 35.0953 114.7090 166.5198 170.8273 185.3403 221.3327 258.6983 265.8994 284.7024 324.8018 344.1418 358.0854 451.0693 490.1275 501.1512 552.0461 560.3185 571.2491 741.1742 763.3630 864.0414 889.5806 894.9880 951.7696 993.4898 1005.3221 1014.1474 1038.2146 1040.9402 1047.1997 1119.2812 1164.3694 1268.1780 1269.9580 1336.8832 1377.8207 1391.8225 1394.5514 1397.2367 1424.6930 1457.4160 1471.7410 1472.5635 1472.8715 1476.8830 1488.6631 1507.2336 1600.7200 1622.6304 1640.9359 2944.1142 2945.0400 2963.0191 3010.4842 3010.6041 3042.0289 3069.9529 3080.0735 3080.4226 3106.7634 3111.0068 3580.7025 3720.0970
redmass: 1.0160 2.4731 2.2138 1.0371 1.2472 2.4632 1.2595 2.4961 2.5279 2.8666 4.4242 1.0718 5.4432 3.0085 3.1597 3.5740 4.1060 3.0437 3.8821 3.7160 1.3223 1.3222 2.3720 3.4142 1.3721 1.7832 1.4231 1.5060 1.4934 1.5476 1.9659 1.7228 1.3272 2.9058 5.3608 2.7930 1.2741 1.2328 1.6292 2.7464 1.4221 1.0461 1.0461 1.0519 1.0772 1.2434 2.1018 7.0520 2.1872 1.7493 1.0394 1.0394 1.0382 1.0976 1.0976 1.0954 1.0992 1.0950 1.0948 1.0909 1.0915 1.0446 1.1036
irintensity: 0.5697 4.1799 4.1757 0.0001 0.7535 0.0019 274.5330 0.9414 0.2860 1.9674 0.0770 0.0108 0.4650 0.0278 0.0354 3.5028 0.3161 3.4562 7.2743 2.2612 22.1339 0.0081 0.5321 0.5756 4.3552 14.3435 9.0821 2.8084 0.0037 23.7119 10.3304 9.2511 4.0165 15.0184 26.8344 0.4197 8.0384 1.0838 15.7693 10.4022 19.5814 23.4201 0.0163 14.1963 1.3192 23.5848 124.7978 0.2777 24.3489 142.1073 65.2635 43.9923 59.3983 0.0644 61.6773 29.0905 20.3439 17.2216 15.8733 36.1941 13.5284 43.7893 22.6755
temp: 298.150 k
press: 1.00000 atm
elementType: 7 6 6 6 6 6 6 6 6 6 1 1 1 1 1 1 1 1 1 1 1 1 1
symmnumber: 1
zpe: 515118.6 jmol-1
zpe.correction: 0.196198 hartree
zpe.thermalcorrener: 0.207462 hartree
zpe.thermalcorrenthalpy: 0.208407 hartree
zpe.thermalcorrgfe: 0.159816 hartree
zpe.sumelectzpe: -404.771319 hartree
zpe.sumelectthermal: -404.760055 hartree
zpe.sumelectthermalent: -404.759111 hartree
zpe.sumelectthermalfe: -404.807701 hartree
dipole: 1.9917 0.0003 0.0567
dipole: 1.9925
quadrupole: -50.8421 -54.9562 -65.7908
quadrupole: -0.0003 -0.0676 0.0000
quadrupole: 6.3543 2.2402 -8.5945 -0.0003 -0.0676 0.0000
hfenergy: -404.9675175 hartree
pointgroup: C01 [X(C9H13N1)]
dipole: 0.7835526 -0.0001872 -0.0231506 debye
dipolederiv: -1.4141731 0.000173 0.0002134 0.0001472 -0.1707203 -0.0000294 0.002418 -0.0000219 -0.7115244 -0.2046234 -0.0553698 -0.0018243 0.3532717 0.2067649 0.0032047 -0.0068686 0.0052612 -0.0653246 -0.2046889 0.0554872 -0.0018253 -0.3531619 0.2068666 -0.0032335 -0.0068225 -0.0053602 -0.0653165 1.3398765 -0.0002142 -0.0065093 -0.0001713 -0.236019 0.0000105 -0.0083932 0.0000189 0.0489334 0.182847 0.0000024 0.0101676 0.0000788 -0.2305109 -0.0000014 0.099147 -0.000014 -0.0546563 0.0139013 0.121921 0.0030105 -0.0628431 0.0695923 -0.0055815 -0.0064268 -0.0089873 -0.2013027 0.0138344 -0.1218862 0.0030385 0.0628609 0.0696372 0.0055865 -0.0064108 0.009028 -0.2013177 0.0083119 -0.0550395 0.0016232 -0.0637469 -0.0169723 -0.000173 0.0038814 -0.0018424 0.1080848 0.0083301 0.0550409 0.0015962 0.0637377 -0.0170137 0.000181 0.0038271 0.0019155 0.1080773 -0.0375976 -0.0000193 0.0039191 -0.0001842 0.0785353 0.0000053 -0.0867657 -0.0000011 0.0937603 0.0312698 0.0927977 0.0034696 0.1030623 -0.0942017 0.0008181 0.0058372 -0.0031321 0.1434092 0.0312496 -0.0928125 0.0034683 -0.1030922 -0.0941572 -0.0008167 0.0058322 0.0031188 0.143403 -0.0297847 -0.0986566 -0.1248093 -0.0263909 0.0299823 0.0165294 -0.127007 -0.0582365 -0.0597613 -0.0271283 -0.0981946 0.123785 -0.0284921 0.0302251 -0.0148107 0.125954 0.0595983 -0.062749 0.0039045 0.1746328 0.0012923 0.0555347 -0.0590849 -0.0009726 0.0007306 -0.001828 0.1072965 -0.0271969 0.0982046 0.1238184 0.0284782 0.0302249 0.0148104 0.1259635 -0.0595938 -0.0626768 -0.029657 0.0986654 -0.1247827 0.0264413 0.0299334 -0.0164714 -0.1269749 0.05829 -0.0598305 0.0038489 -0.1746482 0.0012377 -0.0555468 -0.0590335 0.0009296 0.0006998 0.0017659 0.1072966 0.0029769 -0.0328828 0.0239028 -0.1285651 -0.0741854 0.1032386 0.0769041 0.0824361 0.0501252 0.003208 0.0328632 0.0237689 0.1287279 -0.0746433 -0.1029761 0.0765981 -0.0822209 0.0505191 -0.0841609 -0.000047 -0.0697466 -0.0001309 0.1078762 -0.0002683 -0.1542895 -0.0002133 -0.119142 0.2077295 0.0212307 0.0005923 0.0060838 0.1334508 -0.0004458 0.0010902 -0.0005885 0.3513475 0.2077222 -0.0212481 0.0005936 -0.0060992 0.1334531 0.0004662 0.0010757 0.0006074 0.3513488 unknown
polarizability: 136.2708015|0.0000027|119.4942933|0.2638549|-0.0019844|58.699312 unknown
InChI: InChI=1S/C9H13N/c1-6-4-7(2)9(10)8(3)5-6/h4-5H,10H2,1-3H3
charge 0 multiplicity 1
23 atoms
N  2.543163 -0.000309 -0.010343
C  0.42534 1.238111 0.001514
C  0.425034 -1.238219 0.001568
C  1.138791 -0.000134 -0.004077
C  -1.722006 0.000207 0.013293
C  -0.987883 1.212163 0.012017
C  -0.988168 -1.211945 0.012069
C  1.181941 2.555449 0.002348
C  1.181332 -2.555735 0.002511
C  -3.243524 0.000348 -0.008239
H  -1.530697 2.166716 0.018852
H  -1.531219 -2.166363 0.018911
H  1.836206 2.657473 0.892932
H  1.824829 2.664384 -0.895636
H  0.484132 3.409688 0.010047
H  1.824501 -2.664755 -0.895266
H  1.835265 -2.657975 0.893308
H  0.483322 -3.409813 0.009867
H  -3.654672 -0.891423 0.499295
H  -3.654462 0.893311 0.497358
H  -3.637076 -0.000732 -1.044239
H  3.061611 -0.872007 -0.012805
H  3.061836 0.871258 -0.012882
