program: Gaussian 09
title: 000051014
version: EM64L-G09RevD.01
frameworkgroup: C1[X(C20H18O3)]
method: RPBEPBE
basis: SDD
operation: Freq
keyword: #pfreq=noraman
keyword: PBEPBE/SDD
title: #p freq=noraman PBEPBE/SDD
converged: YES YES NO NO
title: Mulliken charges:
elementType: O O O C C C C C C C C C C C C C C C C C C C C H H H H H H H H H H H H H H H H H H
charge: -0.427718 -0.434080 -0.450796 0.282954 -0.377284 0.209350 0.039046 0.157611 -0.022989 0.296570 -0.201879 0.121030 -0.372972 -0.272585 -0.429417 -0.564932 0.426002 -0.859805 -0.516278 -0.391954 -0.452011 -0.274861 -0.251509 0.239474 0.225037 0.259172 0.236558 0.254683 0.229030 0.267176 0.233984 0.241082 0.276575 0.237290 0.333625 0.335778 0.241591 0.345439 0.231913 0.230130 0.349968
chargesum: 0.00000
title: Mulliken charges with hydrogens summed into heavy atoms:
elementType: O O O C C C C C C C C C C C C C C C C C C C C
charge: -0.091940 -0.088641 -0.100828 0.282954 -0.137810 0.209350 0.039046 0.157611 -0.022989 0.296570 0.023158 0.121030 -0.113800 -0.036027 -0.174735 -0.068726 0.426002 -0.108164 -0.278988 -0.058329 -0.210420 -0.042948 -0.021379
chargesum: -0.00107
polarizability: 4.07006289e+02 4.69987288e+00 2.43158595e+02 4.29554863e+00 7.96334323e+00 1.20232524e+02
1716.lowfreq: -6.9080 -5.5300 -4.8173 -4.3806 -0.0302 -0.0004 35.8255 46.6637 70.9189
frequency: 35.8146 46.6479 70.9145 88.1088 108.6467 120.2440 131.3927 153.6817 172.3259 190.6797 202.1819 231.1856 253.0663 262.9832 289.9779 298.0685 306.7610 319.6472 332.3826 347.8086 375.0702 386.4868 409.6242 437.4525 445.1665 471.9726 486.7524 521.8501 529.9396 545.1258 562.2017 570.0458 599.9003 615.1910 637.2224 662.0622 688.2610 720.7881 744.9096 753.6007 768.7730 791.1030 799.5843 817.0190 840.1087 865.8703 883.0957 896.4359 900.6327 918.8310 930.9638 963.4883 970.2791 972.9962 984.9421 990.5638 1013.8040 1024.9751 1041.0566 1047.3011 1053.2401 1060.4432 1102.1105 1118.8042 1152.2739 1167.2091 1174.6804 1183.4260 1186.3160 1196.8401 1219.4726 1239.0628 1264.9357 1276.2773 1286.1008 1300.6445 1315.9669 1322.4884 1343.2171 1362.3480 1369.7994 1378.2599 1381.2206 1392.3894 1398.9908 1410.2346 1424.3892 1433.6554 1453.5799 1466.1891 1492.4214 1508.3050 1515.0437 1515.4283 1557.8572 1579.6428 1612.6010 1625.1378 1638.6839 2979.8364 2982.1051 3009.7117 3025.2289 3062.1053 3088.0879 3120.1171 3122.3960 3126.4230 3127.5890 3128.2746 3140.5650 3157.2215 3159.9428 3169.5347 3521.3476 3544.6830 3563.1231
redmass: 5.7532 4.6266 5.3064 3.2099 3.7458 3.5419 1.3961 6.3273 5.1485 4.5930 3.8037 4.8810 2.4734 1.8434 1.1682 1.8722 1.6240 2.8765 3.2096 5.0952 3.3837 3.3012 3.9170 3.5849 5.2868 4.7209 4.1501 5.5850 3.7241 5.0646 4.5693 3.7690 3.6467 5.3586 5.8772 4.7280 4.1022 5.4658 3.0270 2.4047 1.2667 3.5153 3.5480 4.0090 1.7209 3.9824 3.7954 1.9875 2.7659 3.3103 5.8994 4.9907 1.3378 1.3217 1.4490 2.7909 1.9755 1.6186 1.6101 1.7570 2.0455 3.5510 2.6987 1.7825 1.4457 1.2153 1.1514 1.3313 1.1673 1.2184 1.4184 2.0053 1.3056 1.9571 1.9981 1.9414 2.0800 1.3386 1.2998 2.5041 1.8273 2.1572 1.8983 4.3318 1.2539 2.2953 2.7686 2.5044 2.1063 1.2262 2.0707 1.3758 1.3426 2.4217 7.1065 6.7089 5.8709 6.5029 6.9680 1.0803 1.0464 1.0682 1.0856 1.0944 1.0961 1.0865 1.0944 1.0899 1.0899 1.0853 1.0948 1.0986 1.1005 1.0944 1.0659 1.0664 1.0666
irintensity: 0.1071 0.0960 2.3302 0.4952 1.7825 4.7815 0.9803 15.0914 3.1523 3.1065 0.4363 2.3203 10.3703 35.6408 74.1950 13.5487 137.2660 32.7590 19.4714 2.3933 17.8430 1.5357 3.9500 0.7098 0.9203 5.6714 8.4175 1.3527 5.1025 0.4533 1.7665 3.1707 2.3051 4.4481 0.9019 1.5587 15.2325 17.3851 2.4909 22.4026 43.3651 2.6476 28.5891 18.6041 57.4466 25.3073 22.4489 13.8269 54.6283 41.7798 123.5629 22.3759 0.9157 1.0407 1.8685 10.5063 14.9641 1.7666 2.8436 3.1470 4.8531 5.3911 5.7341 20.4746 13.6119 32.0104 16.1038 26.5052 3.0845 45.3538 7.3985 4.5586 13.5615 4.3692 11.7594 11.1891 2.9206 4.3143 50.0380 25.6713 16.8864 13.6736 2.4268 5.3816 15.7574 2.3066 3.9034 1.6405 1.4160 14.1432 3.6553 25.4651 12.4402 19.6851 1.3224 3.8906 3.8173 1.3605 6.8670 14.3944 35.5469 45.5319 47.7908 12.8268 9.1938 0.4388 11.3680 2.6266 37.1752 2.4684 2.1983 26.3310 53.6556 19.5432 5.0851 12.9966 8.8796
temp: 298.150 k
press: 1.00000 atm
elementType: 8 8 8 6 6 6 6 6 6 6 6 6 6 6 6 6 6 6 6 6 6 6 6 1 1 1 1 1 1 1 1 1 1 1 1 1 1 1 1 1 1
symmnumber: 1
zpe: 855664.6 jmol-1
zpe.correction: 0.325905 hartree
zpe.thermalcorrener: 0.345756 hartree
zpe.thermalcorrenthalpy: 0.346700 hartree
zpe.thermalcorrgfe: 0.278695 hartree
zpe.sumelectzpe: -996.961051 hartree
zpe.sumelectthermal: -996.941201 hartree
zpe.sumelectthermalent: -996.940257 hartree
zpe.sumelectthermalfe: -997.008262 hartree
dipole: 0.5727 -1.4625 -0.3442
dipole: 1.6079
quadrupole: -123.0578 -126.2769 -139.5258
quadrupole: 4.7392 7.1366 0.3272
quadrupole: 6.5623 3.3433 -9.9056 4.7392 7.1366 0.3272
hfenergy: -997.2869569 hartree
pointgroup: C01 [X(C20H18O3)]
dipole: -0.2126728 0.5783041 -0.1432758 debye
polarizability: 407.1499241|1.1640415|242.8111688|-3.8708514|-9.436224|120.4363153 unknown
InChI: InChI=1S/C20H18O3/c1-11-13-7-6-12-4-2-3-5-14(12)19(13)16(10-21)15-8-9-17(22)20(23)18(11)15/h2-9,17,20-23H,10H2,1H3
charge 0 multiplicity 1
41 atoms
O  -3.616561 1.010295 1.777811
O  -4.697187 -0.020792 -1.658114
O  0.609412 -3.340196 0.685906
C  -1.942397 0.574389 0.120144
C  -3.431592 0.823345 0.315298
C  -1.461771 -0.773719 -0.023785
C  -1.037247 1.649756 0.080557
C  0.886988 0.031506 -0.063799
C  -0.068311 -1.046598 -0.138904
C  0.374888 1.386175 -0.062655
C  -4.361984 -0.289589 -0.228909
C  2.350134 -0.158221 -0.008504
C  -2.446699 -1.873736 -0.016046
C  -3.795894 -1.674276 -0.073917
C  1.289396 2.491128 -0.251244
C  0.341201 -2.467696 -0.491547
C  3.215816 0.975818 -0.246552
C  -1.512862 3.088117 0.227269
C  2.645574 2.290246 -0.402712
C  2.984032 -1.396099 0.342972
C  4.635243 0.813593 -0.258403
C  4.381675 -1.526822 0.347561
C  5.220272 -0.427354 0.015244
H  -3.740834 1.741747 -0.2245
H  -5.343322 -0.199311 0.272133
H  -2.08092 -2.904161 0.042207
H  -4.491917 -2.519821 -0.068925
H  0.888526 3.505938 -0.311851
H  -0.433291 -2.945919 -1.117821
H  1.279909 -2.479053 -1.065029
H  -1.483873 3.629618 -0.738406
H  -0.875083 3.643129 0.93715
H  -2.536748 3.138139 0.621786
H  3.317618 3.134959 -0.594878
H  2.384132 -2.247916 0.677316
H  -4.56296 1.262116 1.945046
H  5.261391 1.691015 -0.46007
H  -3.949672 -0.359891 -2.215871
H  4.827645 -2.486757 0.630739
H  6.309436 -0.543986 0.009734
H  -0.024665 -3.098817 1.408168
