program: Gaussian 09
title: 000050958
version: EM64L-G09RevD.01
frameworkgroup: C1[X(C20H11NO2)]
method: RPBEPBE
basis: SDD
operation: Freq
keyword: #p
keyword: freq=noraman
keyword: PBEPBE/SDD
title: #p freq=noraman PBEPBE/SDD
converged: YES YES YES YES
title: Mulliken charges:
elementType: O O N C C C C C C C C C C C C C C C C C C C C H H H H H H H H H H H
charge: -0.218993 -0.225684 0.015425 0.014660 0.060237 0.355429 0.513388 0.302170 0.492650 0.151757 0.470223 -0.808342 -0.449678 -0.463538 -0.494567 -0.487979 0.210380 -0.473471 -0.450550 -0.336862 -0.453449 -0.253903 -0.247393 0.250733 0.229353 0.309530 0.249652 0.249083 0.250824 0.289962 0.230357 0.249313 0.233778 0.235505
chargesum: 0.00000
title: Mulliken charges with hydrogens summed into heavy atoms:
elementType: O O N C C C C C C C C C C C C C C C C C C C C
charge: -0.218993 -0.225684 0.015425 0.014660 0.060237 0.355429 0.513388 0.302170 0.492650 0.151757 0.470223 -0.557608 -0.220325 -0.154007 -0.244915 -0.238896 0.210380 -0.222647 -0.160588 -0.106505 -0.204136 -0.020125 -0.011889
polarizability: 5.09266536e+02 8.60651217e+00 2.78390506e+02 -8.60298845e-03 2.59269805e-04 8.34227073e+01
1716.lowfreq: -6.3716 -0.0004 0.0008 0.0010 3.3308 7.4846 15.7810 49.1853 65.9123
frequency: 15.5981 49.1827 65.9113 101.9524 152.9090 157.0190 214.4798 231.1996 257.4870 295.2650 296.3855 316.4215 345.8406 371.0489 398.8246 433.4736 461.1838 486.9659 502.6434 516.6993 522.4594 539.8777 551.2958 558.0823 566.2781 583.8968 626.9477 641.1803 681.3101 693.3360 698.3633 713.0314 738.4155 761.1896 780.4650 794.9757 814.6756 836.0608 842.3206 851.9247 864.5098 871.2047 882.8396 886.5539 944.9279 966.8664 987.4888 995.4369 999.6233 1008.3834 1013.9216 1027.0648 1047.5452 1115.8910 1131.8561 1156.1812 1159.0059 1179.8333 1181.0246 1193.6447 1199.4551 1218.3668 1254.5441 1264.1730 1290.2974 1320.0389 1324.7511 1342.2023 1391.5324 1393.4778 1410.6037 1413.6243 1422.0762 1428.7309 1445.3518 1467.1018 1479.4095 1503.1772 1517.7141 1562.7705 1577.6959 1596.8274 1605.6613 1624.3798 1632.2690 3122.7097 3126.8558 3127.5113 3138.4044 3143.7064 3151.2113 3152.2859 3160.2264 3171.4294 3188.4891 3217.5532
redmass: 14.9890 6.2025 4.9624 4.4159 4.4949 7.7605 4.4295 4.8217 7.2923 4.6944 9.4517 4.2649 7.6149 7.2087 3.6450 6.8396 3.1367 5.9472 3.6583 5.9112 3.9542 7.4917 3.1415 6.1774 3.6199 7.0217 6.2954 7.0386 7.1719 3.4698 6.3064 3.7378 8.9198 1.2888 2.4104 5.3279 1.3912 7.0357 2.5617 5.2421 1.4725 1.6038 5.7856 1.8829 2.0771 1.4335 1.3974 1.3833 1.4167 1.3488 4.8674 3.2735 3.3119 2.5653 2.1784 2.0338 1.4743 1.1071 3.8919 1.6613 1.5055 1.3919 1.8999 1.8059 2.1731 2.3754 4.6043 3.5519 3.9289 3.9178 4.9496 2.1384 2.9954 5.9877 3.6790 3.8482 3.6295 4.6130 4.1284 5.6684 8.4062 5.9952 6.7641 6.6147 6.9069 1.0912 1.0867 1.0868 1.0888 1.0910 1.0981 1.0932 1.0926 1.0977 1.0938 1.0931
irintensity: 0.0002 0.3942 1.6416 0.9600 1.3265 2.1046 3.4520 5.8528 1.0556 0.1025 0.3466 0.5118 0.2951 0.2507 0.1539 0.1181 5.2120 0.4311 0.2972 9.5969 2.3435 0.4375 3.9425 2.8541 0.8671 0.5839 2.8721 1.4942 12.8439 0.2313 1.6320 0.7456 10.1028 69.3183 29.2620 9.2066 1.4414 7.8128 15.9295 5.4482 0.3428 37.6175 2.1357 35.5923 39.6726 14.0806 1.0567 0.4038 2.5035 0.9299 3.8585 1.7413 12.3530 5.2334 1.7640 125.3147 4.3074 2.3320 713.1429 0.6808 150.1413 1.8793 2.3589 9.1680 21.4560 11.4474 2.2575 31.0972 44.0568 12.3287 0.7026 6.2557 4.3689 7.2467 4.0772 2.6151 8.7525 56.4293 19.4964 18.6397 13.2556 2.1029 74.6677 13.6588 38.2423 4.3308 1.1435 3.8820 8.5776 6.4237 29.2561 7.2561 28.0113 36.6765 3.0207 9.1053
temp: 298.150 k
press: 1.00000 atm
elementType: 8 8 7 6 6 6 6 6 6 6 6 6 6 6 6 6 6 6 6 6 6 6 6 1 1 1 1 1 1 1 1 1 1 1
symmnumber: 1
zpe: 660739.4 jmol-1
zpe.correction: 0.251662 hartree
zpe.thermalcorrener: 0.267431 hartree
zpe.thermalcorrenthalpy: 0.268375 hartree
zpe.thermalcorrgfe: 0.207508 hartree
zpe.sumelectzpe: -972.390008 hartree
zpe.sumelectthermal: -972.374239 hartree
zpe.sumelectthermalent: -972.373295 hartree
zpe.sumelectthermalfe: -972.434162 hartree
dipole: -6.4616 4.0150 0.0004
dipole: 7.6073
quadrupole: -137.1755 -116.7562 -137.2073
quadrupole: 18.7145 0.0035 0.0011
quadrupole: -6.7958 13.6235 -6.8277 18.7145 0.0035 0.0011
hfenergy: -972.6416701 hartree
pointgroup: C01 [X(C20H11N1O2)]
dipole: -2.5126227 -1.6262065 -0.0001525 debye
polarizability: 509.505331|-4.3454577|278.1517112|0.0085967|0.0004178|83.4227073 unknown
InChI: InChI=1S/C20H11NO2/c22-21(23)18-10-7-12-5-6-14-11-13-3-1-2-4-15(13)16-8-9-17(18)19(12)20(14)16/h1-11H
charge 0 multiplicity 1
34 atoms
O  5.477637 1.287561 0.000699
O  3.762499 2.774058 -0.000314
N  4.207814 1.556013 0.000032
C  -0.416185 -0.560115 0.000003
C  1.025375 -0.63568 -0.000002
C  -1.08369 0.708227 0.000029
C  -1.20127 -1.785319 -0.000017
C  1.825595 0.576215 -0.000003
C  1.662358 -1.933426 -0.000005
C  -2.538063 0.769928 0.000032
C  -3.294881 -0.466599 0.000002
C  -2.603827 -1.713675 -0.000022
C  -0.264592 1.886529 0.00005
C  1.122665 1.83519 0.000026
C  -0.522352 -3.062794 -0.000033
C  0.854848 -3.133459 -0.000025
C  3.259369 0.419227 0.000023
C  3.078691 -2.017021 0.000015
C  3.864708 -0.858294 0.000042
C  -3.268836 2.00126 0.000063
C  -4.729714 -0.423577 -0.000002
C  -4.66751 2.016646 0.000062
C  -5.408589 0.794359 0.000027
H  -3.188223 -2.642335 -0.000043
H  -0.735977 2.873271 0.000072
H  1.703712 2.755584 0.000007
H  -1.129133 -3.975574 -0.000045
H  1.366424 -4.102183 -0.00003
H  3.558834 -3.001262 0.000007
H  4.955667 -0.910453 0.000074
H  -2.734273 2.955201 0.000092
H  -5.284027 -1.369368 -0.000027
H  -5.201273 2.973119 0.000089
H  -6.503279 0.820448 0.000023
