program: Orca
programVersion: 5.0.3
elementType: C H C H C C C H H C H H C C H H H H H H H
charge: 1
multiplicity: 1
keywords: DSD-PBEP86 cc-pVTZ EnGrad RIJCOSX verytightscf cc-pVTZ/C def2/J soscf
formula: C8H13
InChI: InChI=1/C8H13/c1-2-4-6-8-7-5-3-1/h1-2,7H,3-6,8H2
21 atoms
C  -2.005951 0.706024 0.085342
H  -2.216379 0.879517 1.144719
C  -1.78011 -0.92201 -0.14057
H  -2.622274 -1.393925 0.369348
C  -0.433509 -1.344577 0.41155
C  0.69938 -1.282376 -0.362172
C  2.010562 -0.685845 0.075342
H  2.224798 -0.881741 1.130834
H  2.858692 -1.016902 -0.527112
C  1.805895 0.906177 -0.141035
H  1.866767 1.134081 -1.210223
H  2.622404 1.426829 0.362557
C  0.429739 1.289837 0.423228
C  -0.725974 1.313884 -0.361502
H  0.530517 -1.201884 -1.440593
H  -1.859102 -1.130171 -1.211326
H  0.031266 0.093472 0.484974
H  -0.574355 1.287383 -1.445038
H  -2.864789 1.001017 -0.519173
H  0.348498 1.526779 1.488672
H  -0.346441 -1.499686 1.489177
totalener: -311.09344394 hartree
nucrepener: 382.13971372 hartree
electener: -693.23315766 hartree
oneelecener: -1164.28662320 hartree
twoeener: 471.05346554 hartree
kineticenergy: 309.65302345 hartree
exchangeener: -12.747369887104 hartree
correlationener: -0.948244234913 hartree
xcener: -13.695614122017 hartree
chargesum: 1.0000000
charge: -0.250324 0.178877 -0.282802 0.190554 -0.089242 -0.066565 -0.247176 0.170830 0.186096 -0.273762 0.171254 0.186914 -0.103055 -0.012790 0.180432 0.176439 0.088819 0.193634 0.192996 0.208149 0.200723
charge: 0.108071 -0.000052 0.118708 0.002688 0.084816 0.143033 0.096016 -0.002611 0.001116 0.115550 -0.005631 0.000309 0.113118 0.205344 -0.002813 -0.004868 -0.001259 0.006710 0.004353 0.017620 -0.000218
qa: -0.2503 0.1789 -0.2828 0.1906 -0.0892 -0.0666 -0.2472 0.1708 0.1861 -0.2738 0.1713 0.1869 -0.1031 -0.0128 0.1804 0.1764 0.0888 0.1936 0.1930 0.2081 0.2007
va: 3.8805 0.9795 3.9384 0.9719 3.7953 3.8214 3.8874 0.9823 0.9720 3.9295 0.9820 0.9750 3.7888 3.7615 0.9800 0.9795 1.1198 0.9751 0.9710 0.9766 0.9768
energy: -311.810098562146
dipole: -0.00037 -0.17718 -0.17755 0.21090 0.06269 0.27360 0.10961 -0.12808 -0.01847
magnitude: 0.32668 au
magnitude: 0.83036 debye
