program: Orca
programVersion: 5.0.3
elementType: C H C H C C C H H C H H C C H H H H H H H
charge: 1
multiplicity: 1
keywords: DSD-PBEP86/2013 cc-pVTZ EnGrad D3BJ RIJCOSX verytightscf cc-pVTZ/C def2/J soscf
formula: C8H13
InChI: InChI=1/C8H13/c1-2-4-6-8-7-5-3-1/h1-2,7H,3-6,8H2
21 atoms
C  -1.990231 0.57807 0.093965
H  -2.167188 0.756345 1.16036
C  -1.844675 -0.964297 -0.17376
H  -2.655794 -1.504393 0.322506
C  -0.450702 -1.28984 0.34227
C  0.644319 -1.226883 -0.448956
C  1.937309 -0.691986 0.07266
H  2.093874 -0.944794 1.126492
H  2.805835 -1.036366 -0.49858
C  1.831047 0.858721 -0.093453
H  1.879957 1.120017 -1.156993
H  2.670784 1.357881 0.398417
C  0.495765 1.434763 0.511443
C  -0.666596 1.131117 -0.317006
H  0.527409 -1.280629 -1.532779
H  -1.908151 -1.16081 -1.248941
H  0.352162 1.13967 1.553877
H  -0.561298 1.385266 -1.376575
H  -2.808834 1.005509 -0.495352
H  0.62172 2.535776 0.477827
H  -0.323442 -1.306733 1.425975
totalener: -311.14543344 hartree
nucrepener: 380.71557919 hartree
electener: -691.86101263 hartree
oneelecener: -1161.81422039 hartree
twoeener: 469.95320776 hartree
kineticenergy: 309.72454377 hartree
exchangeener: -14.120148553071 hartree
correlationener: -0.943546152737 hartree
xcener: -15.063694705809 hartree
chargesum: 1.0000000
charge: -0.224560 0.178620 -0.228405 0.181189 -0.129553 -0.148249 -0.237098 0.163289 0.179199 -0.243884 0.156769 0.181351 -0.231285 0.047713 0.198379 0.165914 0.172013 0.232744 0.186441 0.210716 0.188698
charge: 0.091185 0.007618 0.093510 -0.000062 0.094058 0.072741 0.071497 -0.001695 0.005155 0.110128 -0.007859 -0.000515 0.072353 0.346872 -0.013790 -0.000115 0.004017 0.016371 0.009263 0.041765 -0.012498
qa: -0.2246 0.1786 -0.2284 0.1812 -0.1296 -0.1482 -0.2371 0.1633 0.1792 -0.2439 0.1568 0.1814 -0.2313 0.0477 0.1984 0.1659 0.1720 0.2327 0.1864 0.2107 0.1887
va: 3.8553 0.9799 3.9016 0.9745 3.8324 3.8415 3.9074 0.9855 0.9770 3.8810 0.9833 0.9724 3.9090 3.5599 0.9727 0.9852 0.9852 0.9557 0.9761 0.9654 0.9804
dispcorr: -0.014228084 hartree
energy: -311.830756603970
dipole: 0.49383 -0.92102 -0.42719 1.93479 -0.96553 0.96927 0.14621 -0.28065 -0.13444
magnitude: 1.06773 au
magnitude: 2.71395 debye
