program: Orca
programVersion: 5.0.3
elementType: C H C H C C C H H C H H C C H H H H H H H
charge: 1
multiplicity: 1
keywords: PBE0 cc-pVTZ EnGrad RIJCOSX verytightscf cc-pVTZ/C def2/J soscf
formula: C8H13
InChI: InChI=1/C8H13/c1-2-4-6-8-7-5-3-1/h1-2,7H,3-6,8H2
21 atoms
C  -1.997597 0.758467 0.071335
H  -2.165969 0.839453 1.148032
C  -1.732194 -0.960571 -0.155077
H  -2.618367 -1.316292 0.375022
C  -0.419301 -1.384283 0.39518
C  0.688008 -1.27887 -0.374111
C  2.002897 -0.6898 0.063608
H  2.212545 -0.883932 1.121154
H  2.856642 -1.03254 -0.526655
C  1.791057 0.866481 -0.142686
H  1.837651 1.123238 -1.206525
H  2.595788 1.412246 0.356606
C  0.421678 1.255266 0.482487
C  -0.767054 1.305825 -0.377363
H  0.524083 -1.206872 -1.454007
H  -1.836727 -1.124015 -1.228095
H  0.173868 0.508873 1.246443
H  -0.656648 1.55299 -1.436767
H  -2.88058 0.987655 -0.523847
H  0.448727 2.177833 1.094674
H  -0.339066 -1.49357 1.476637
totalener: -312.02689075 hartree
nucrepener: 379.70033381 hartree
electener: -691.72722457 hartree
oneelecener: -1160.40007537 hartree
twoeener: 468.67285080 hartree
kineticenergy: 309.64343308 hartree
exchangeener: -34.145952482389 hartree
correlationener: -1.961599701072 hartree
xcener: -36.107552183462 hartree
chargesum: 1.0000000
charge: -0.203465 0.175033 -0.184199 0.174258 -0.141826 -0.094575 -0.172992 0.133243 0.146764 -0.199904 0.137224 0.150889 -0.205935 0.112761 0.140495 0.167907 0.142013 0.197341 0.178788 0.191581 0.154597
charge: 0.130028 0.013931 0.169675 0.008979 0.018390 0.076724 0.076430 -0.003486 -0.002808 0.106211 -0.011169 -0.000311 0.077690 0.299334 -0.015045 -0.000131 0.010222 0.015016 0.007037 0.043552 -0.020268
qa: -0.2035 0.1750 -0.1842 0.1743 -0.1418 -0.0946 -0.1730 0.1332 0.1468 -0.1999 0.1372 0.1509 -0.2059 0.1128 0.1405 0.1679 0.1420 0.1973 0.1788 0.1916 0.1546
va: 3.8616 0.9817 3.8869 0.9777 3.8199 3.8282 3.8855 0.9951 0.9881 3.8712 0.9934 0.9868 3.8740 3.5751 0.9940 0.9827 1.0175 0.9771 0.9823 0.9772 0.9961
energy: -312.026890753456
dipole: 0.14222 -0.98805 -0.84583 1.44662 -0.40414 1.04248 0.41460 -0.51115 -0.09655
magnitude: 1.34593 au
magnitude: 3.42107 debye
