program: Orca
programVersion: 5.0.3
elementType: C H C H C C C H H C H H C C H H H H H H H
charge: 1
multiplicity: 1
keywords: DSD-PBEP86 cc-pVTZ EnGrad RIJCOSX verytightscf cc-pVTZ/C def2/J soscf
formula: C8H13
InChI: InChI=1/C8H13/c1-2-4-6-8-7-5-3-1/h1-2,7H,3-6,8H2
21 atoms
C  -1.992638 0.518461 0.066236
H  -2.198588 0.793208 1.103964
C  -2.000169 -1.023444 -0.115935
H  -2.679187 -1.575199 0.534617
C  -0.542497 -1.0842 0.292665
C  0.570328 -1.057653 -0.530092
C  1.901363 -0.628065 0.011731
H  2.027185 -1.005446 1.032218
H  2.71703 -1.019818 -0.601062
C  1.936942 0.939041 0.025869
H  2.147062 1.304719 -0.985322
H  2.748016 1.285744 0.671259
C  0.567452 1.467847 0.492711
C  -0.490204 0.7071 -0.263952
H  0.463696 -1.27398 -1.592038
H  -2.159971 -1.32106 -1.155763
H  0.430154 1.368112 1.574808
H  -0.362627 0.803085 -1.345603
H  -2.646734 1.086252 -0.600313
H  0.469498 2.534359 0.248028
H  -0.360979 -1.025853 1.366424
totalener: -311.18280289 hartree
nucrepener: 387.55730452 hartree
electener: -698.74010741 hartree
oneelecener: -1175.28442455 hartree
twoeener: 476.54431714 hartree
kineticenergy: 309.75697403 hartree
exchangeener: -12.764627327584 hartree
correlationener: -0.949945845209 hartree
xcener: -13.714573172793 hartree
chargesum: 1.0000000
charge: -0.215702 0.171658 -0.245811 0.186475 -0.035989 -0.044442 -0.256125 0.167914 0.183160 -0.252265 0.164782 0.181316 -0.241592 -0.096931 0.226329 0.171742 0.160060 0.194747 0.183967 0.192541 0.204164
charge: 0.109770 0.000289 0.109037 -0.000357 0.127145 0.179921 0.086016 0.002878 0.006310 0.095902 -0.006144 -0.000148 0.066341 0.184833 0.006374 -0.000112 -0.003806 0.005308 -0.002055 0.015631 0.016866
qa: -0.2157 0.1717 -0.2458 0.1865 -0.0360 -0.0444 -0.2561 0.1679 0.1832 -0.2523 0.1648 0.1813 -0.2416 -0.0969 0.2263 0.1717 0.1601 0.1947 0.1840 0.1925 0.2042
va: 3.8667 0.9847 3.8897 0.9768 3.7783 3.7661 3.9224 0.9812 0.9765 3.8956 0.9800 0.9736 3.8927 3.7786 0.9590 0.9844 0.9845 0.9820 0.9745 0.9676 0.9764
energy: -311.886831743914
dipole: 0.55716 -0.71961 -0.16245 1.82918 -1.94335 -0.11418 0.23526 -0.40382 -0.16856
magnitude: 0.26046 au
magnitude: 0.66203 debye
