program: Orca
programVersion: 5.0.3
elementType: C H C H C C C H H C H H C C H H H H H H H
charge: 1
multiplicity: 1
keywords: PBE0 cc-pVTZ EnGrad RIJCOSX verytightscf cc-pVTZ/C def2/J soscf
formula: C8H13
InChI: InChI=1/C8H13/c1-2-4-6-8-7-5-3-1/h1-2,7H,3-6,8H2
21 atoms
C  -2.003064 0.717775 0.071387
H  -2.174614 0.798199 1.148344
C  -1.743427 -0.971979 -0.170372
H  -2.624668 -1.367708 0.340762
C  -0.410137 -1.376437 0.381533
C  0.675976 -1.268087 -0.397405
C  1.988141 -0.706012 0.065088
H  2.185888 -0.925854 1.119527
H  2.848397 -1.038551 -0.523524
C  1.792952 0.831873 -0.126103
H  1.826058 1.0947 -1.189341
H  2.60088 1.380063 0.365849
C  0.434015 1.324341 0.49863
C  -0.758601 1.278003 -0.344061
H  0.514959 -1.189285 -1.477139
H  -1.829795 -1.140026 -1.245472
H  0.246864 0.863485 1.470931
H  -0.657289 1.634263 -1.373632
H  -2.873189 0.99377 -0.524668
H  0.547411 2.41691 0.682215
H  -0.318684 -1.453475 1.464354
totalener: -312.03885873 hartree
nucrepener: 379.04844163 hartree
electener: -691.08730036 hartree
oneelecener: -1159.13694969 hartree
twoeener: 468.04964933 hartree
kineticenergy: 309.64423577 hartree
exchangeener: -34.148200642927 hartree
correlationener: -1.959818182857 hartree
xcener: -36.108018825783 hartree
chargesum: 1.0000000
charge: -0.195511 0.175019 -0.178326 0.167828 -0.155649 -0.113963 -0.169682 0.136148 0.147872 -0.197933 0.137143 0.151119 -0.189355 0.101497 0.140645 0.163567 0.149297 0.208370 0.175602 0.186318 0.159994
charge: 0.127161 0.014918 0.159997 0.004771 0.025626 0.053334 0.070035 -0.002103 0.000586 0.108913 -0.008625 0.000411 0.083227 0.313249 -0.016453 -0.000808 0.007728 0.021055 0.007140 0.052116 -0.022277
qa: -0.1955 0.1750 -0.1783 0.1678 -0.1556 -0.1140 -0.1697 0.1361 0.1479 -0.1979 0.1371 0.1511 -0.1894 0.1015 0.1406 0.1636 0.1493 0.2084 0.1756 0.1863 0.1600
va: 3.8478 0.9830 3.8791 0.9802 3.8093 3.8375 3.8802 0.9948 0.9886 3.8691 0.9917 0.9855 3.8978 3.5552 0.9941 0.9847 0.9994 0.9707 0.9854 0.9782 0.9932
energy: -312.038858726245
dipole: 0.27364 -1.05982 -0.78618 1.93484 -0.65733 1.27750 0.24175 -0.37256 -0.13081
magnitude: 1.50572 au
magnitude: 3.82725 debye
