program: Gaussian 09
title: 000050949
version: EM64L-G09RevD.01
frameworkgroup: C1[X(C12H17NO5S)]
method: RPBEPBE
basis: SDD
operation: Freq
keyword: #p
keyword: freq=noraman
keyword: PBEPBE/SDD
title: #p freq=noraman PBEPBE/SDD
converged: NO YES NO NO
title: Mulliken charges:
elementType: S O O O O O N C C C C C C C C C C C C H H H H H H H H H H H H H H H H H
charge: 0.948419 -0.262436 -0.541489 -0.526719 -0.317807 -0.227368 -0.720668 -0.097074 -0.286404 -0.687462 -0.694774 0.395438 -0.221645 0.386450 -0.515401 -0.344348 -0.226091 0.183963 -0.513710 0.222115 0.216584 0.206349 0.216653 0.199632 0.245572 0.228010 0.213958 0.207124 0.295531 0.299699 0.267917 0.335293 0.351286 0.265933 0.273270 0.224198
chargesum: 0.00000
title: Mulliken charges with hydrogens summed into heavy atoms:
elementType: S O O O O O N C C C C C C C C C C C C
charge: 0.948419 -0.262436 -0.541489 -0.526719 -0.317807 -0.227368 -0.034089 0.125041 0.136529 -0.025605 -0.045682 0.395438 -0.221645 0.386450 -0.219870 -0.076430 0.073607 0.183963 0.249691
polarizability: 2.63280269e+02 3.07132814e+00 1.82057050e+02 1.80590514e+00 -4.86458691e+00 1.18746806e+02
1716.lowfreq: -2.9488 0.0010 0.0012 0.0015 6.2503 7.6399 29.0010 37.0983 44.8907
frequency: 28.9204 37.0434 44.8858 65.7743 74.7507 82.4613 88.6438 114.5787 122.4796 148.4269 163.1405 172.0707 191.0299 198.8963 216.0961 230.3779 239.1045 246.5486 261.9495 276.3243 300.7541 334.9407 349.5183 370.3546 382.8902 391.1233 411.5687 436.0911 443.9935 469.2652 482.8040 530.3874 590.3402 620.0456 661.7017 696.5680 743.7183 757.1712 781.5311 814.6539 828.3020 836.4271 839.5586 908.1590 920.1560 921.0608 921.6705 932.4013 955.4843 970.2915 977.2575 988.0819 995.1067 1067.3335 1091.6869 1120.4394 1135.7587 1147.4696 1148.4635 1159.0317 1191.9383 1195.6718 1237.1774 1240.0009 1271.4739 1298.6708 1345.3657 1366.3386 1377.6477 1389.6687 1398.9826 1408.3401 1417.1863 1455.2670 1455.7352 1463.2296 1469.9669 1475.5651 1477.8014 1481.2816 1490.4489 1505.0137 1570.3058 1608.6797 1641.9513 2950.3616 2973.2441 2978.4288 2994.6864 3009.9778 3022.4407 3064.5257 3073.0684 3082.0202 3095.4557 3126.6273 3143.6301 3147.3273 3173.7801 3176.2667 3373.6817 3551.8101
redmass: 4.2511 2.8458 5.9848 4.0230 1.6603 1.9160 4.5360 4.7086 4.2905 3.6349 5.0806 4.1390 1.7984 1.6401 3.4793 1.8869 2.0980 3.7115 2.9270 3.8184 5.7112 3.9292 3.6829 4.3820 3.3488 2.9953 2.7263 3.0930 5.0393 4.0667 3.8934 4.1400 4.7632 7.0237 7.2122 4.6660 5.4520 4.7180 2.1117 4.7039 3.1350 1.8099 2.5722 2.1242 1.3506 1.6904 3.3788 2.1811 1.7148 1.7437 1.3922 4.1052 6.9984 1.6873 1.7906 1.3099 1.9361 1.5083 1.7543 1.4739 1.7918 2.5191 1.4311 1.7417 2.0605 1.3677 1.4269 1.5650 1.2133 2.6449 1.4521 1.6416 2.3713 1.7013 1.2803 1.1470 1.0459 1.0890 1.0538 1.0505 1.0593 1.0954 6.7330 6.9401 10.5189 1.0548 1.0361 1.0383 1.0848 1.0279 1.1062 1.0994 1.0987 1.0987 1.0994 1.1057 1.1059 1.0900 1.0922 1.0944 1.0404 1.1016
irintensity: 1.3062 0.8606 2.5882 1.1153 1.0884 1.6385 2.9566 3.0795 0.7175 1.1023 1.8892 1.6912 6.2337 3.5190 4.9376 2.4481 2.8559 12.3424 9.6846 7.8744 4.4500 18.7624 5.0291 9.4911 7.1093 68.7458 3.2532 9.7212 42.2806 20.9231 109.2459 38.4719 21.5213 1.4037 4.7161 4.7566 8.9381 1.8488 117.0891 40.8554 18.5933 30.8035 39.0570 13.8736 1.0024 15.8323 86.3497 15.5956 8.5587 16.3427 8.7023 155.4509 150.5684 75.0286 51.3689 0.3079 3.0367 5.7281 1.2145 15.6925 13.2409 33.7938 103.0226 166.3588 338.8732 1.9606 1.3900 3.7969 22.0034 29.3537 22.7420 17.7687 117.8295 45.4086 11.5021 0.7017 1.6843 6.4349 12.7822 13.9560 26.7029 27.4378 135.7226 40.2583 178.8244 26.1135 35.5790 26.8361 6.0574 32.3962 34.6964 26.1123 57.8444 49.2524 34.3641 9.9060 8.5941 5.3853 1.1687 13.1022 23.2464 52.9508
temp: 298.150 k
press: 1.00000 atm
elementType: 16 8 8 8 8 8 7 6 6 6 6 6 6 6 6 6 6 6 6 1 1 1 1 1 1 1 1 1 1 1 1 1 1 1 1 1
symmnumber: 1
zpe: 727378.0 jmol-1
zpe.correction: 0.277044 hartree
zpe.thermalcorrener: 0.298546 hartree
zpe.thermalcorrenthalpy: 0.299490 hartree
zpe.thermalcorrgfe: 0.225869 hartree
zpe.sumelectzpe: -1294.765411 hartree
zpe.sumelectthermal: -1294.743909 hartree
zpe.sumelectthermalent: -1294.742965 hartree
zpe.sumelectthermalfe: -1294.816586 hartree
dipole: -3.5897 0.6526 3.8283
dipole: 5.2884
quadrupole: -93.3291 -129.2652 -126.8365
quadrupole: 16.9773 14.4240 0.7101
quadrupole: 23.1479 -12.7883 -10.3595 16.9773 14.4240 0.7101
hfenergy: -1295.0424548 hartree
pointgroup: C01 [X(C12H17N1O5S1)]
dipole: 1.4306332 -0.3090387 1.4787783 debye
polarizability: 263.1957045|3.5443607|181.6141492|-3.3717271|7.2421906|119.2742715 unknown
InChI: InChI=1S/C12H17NO5S/c1-8(2)7-18-9-4-5-11(19(13,15)16)10(6-9)12(14)17-3/h4-6,8H,7,13H2,1-3H3
charge 0 multiplicity 1
36 atoms
S  -2.956204 1.330086 -0.036357
O  2.841429 -0.466042 0.318301
O  -2.855173 2.93839 -0.260308
O  -3.761563 0.437954 -1.137585
O  -2.977498 -1.560529 0.797357
O  -1.567227 -2.920251 -0.472416
N  -3.580077 1.153873 1.667398
C  5.2648 -0.230856 0.388054
C  3.933562 0.533873 0.374261
C  5.45846 -1.049552 -0.907859
C  6.423346 0.771941 0.605555
C  1.529434 -0.009023 0.274274
C  -1.183671 0.685384 0.175435
C  -0.832922 -0.688228 0.168862
C  0.538201 -1.019051 0.203188
C  1.150221 1.358512 0.292473
C  -0.216747 1.698102 0.231977
C  -1.797491 -1.832674 0.097222
C  -4.118786 -2.482774 0.557636
H  5.233865 -0.930222 1.247226
H  3.817039 1.144152 1.293371
H  3.869719 1.195532 -0.51517
H  6.390091 -1.641645 -0.858568
H  5.529324 -0.380781 -1.78764
H  4.615237 -1.742402 -1.069048
H  7.390601 0.239734 0.632271
H  6.316094 1.326185 1.5569
H  6.470819 1.509005 -0.21902
H  0.840206 -2.069731 0.173297
H  -0.542166 2.743719 0.206768
H  1.896637 2.155141 0.340988
H  -4.410081 1.753969 1.791451
H  -3.715514 0.14965 1.864572
H  -3.743809 -3.481385 0.284763
H  -4.718183 -2.049895 -0.259969
H  -4.687976 -2.515162 1.498139
