program: Orca
programVersion: 5.0.3
elementType: C H C H C C C H H C H H C C H H H H H H H
charge: 1
multiplicity: 1
keywords: DSD-PBEP86 def2-TZVP D3BJ RIJCOSX verytightscf def2-TZVP/C def2/J soscf noTRAH
formula: C8H13
InChI: InChI=1/C8H13/c1-2-4-6-8-7-5-3-1/h1-2,7H,3-6,8H2
21 atoms
C  -1.996337 0.533829 0.119871
H  -2.173101 0.724451 1.182035
C  -1.94292 -0.993165 -0.171999
H  -2.67457 -1.582199 0.383871
C  -0.510043 -1.160186 0.287667
C  0.614149 -1.137149 -0.498956
C  1.909046 -0.656933 0.06703
H  2.014184 -0.951782 1.116522
H  2.767718 -1.043631 -0.488789
C  1.88568 0.906758 -0.0423
H  1.999509 1.194471 -1.094199
H  2.73545 1.331259 0.4989
C  0.551965 1.481387 0.494028
C  -0.561496 0.862114 -0.271323
H  0.532569 -1.304774 -1.572539
H  -2.051248 -1.198201 -1.241291
H  0.432085 1.343866 1.573366
H  -0.430323 0.925202 -1.354516
H  -2.729531 1.088601 -0.475016
H  0.539822 2.566641 0.297544
H  -0.361695 -1.11046 1.367804
totalener: -311.15137189 hartree
nucrepener: 384.81766884 hartree
electener: -695.96904073 hartree
oneelecener: -1169.92423100 hartree
twoeener: 473.95519027 hartree
kineticenergy: 310.02542078 hartree
exchangeener: -13.673766992968 hartree
correlationener: -0.925983934449 hartree
xcener: -14.599750927417 hartree
chargesum: 1.0000000
charge: -0.202895 0.164715 -0.199805 0.177772 -0.087139 -0.079818 -0.223093 0.157666 0.174709 -0.235023 0.150947 0.173546 -0.203609 -0.005301 0.198068 0.159926 0.153075 0.187805 0.176605 0.185026 0.176824
charge: -0.193982 0.153526 -0.188595 0.149621 -0.062514 -0.039552 -0.208284 0.153709 0.156399 -0.206050 0.146153 0.150490 -0.223515 0.074739 0.163088 0.152185 0.152600 0.171362 0.153156 0.177034 0.168432
qa: -0.2029 0.1647 -0.1998 0.1778 -0.0871 -0.0798 -0.2231 0.1577 0.1747 -0.2350 0.1509 0.1735 -0.2036 -0.0053 0.1981 0.1599 0.1531 0.1878 0.1766 0.1850 0.1768
va: 3.8655 0.9732 3.8640 0.9719 3.8487 3.8220 3.9038 0.9694 0.9689 3.8684 0.9717 0.9661 3.9167 3.6808 0.9498 0.9742 0.9724 0.9524 0.9706 0.9642 0.9611
total: -311.825287847 hartree
dispcorr: -0.011740011 hartree
energy: -311.837027857514
dipole: 0.56309 -0.80755 -0.24446 1.85665 -1.61311 0.24353 0.18135 -0.36010 -0.17875
magnitude: 0.38862 au
magnitude: 0.98778 debye
