program: Orca
programVersion: 5.0.3
elementType: C H C H C C C H H C H H C C H H H H H H H
charge: 1
multiplicity: 1
keywords: DSD-PBEP86 cc-pVTZ EnGrad RIJCOSX verytightscf cc-pVTZ/C def2/J soscf
formula: C8H13
InChI: InChI=1/C8H13/c1-2-4-6-8-7-5-3-1/h1-2,7H,3-6,8H2
21 atoms
C  -1.999609 0.735336 0.077719
H  -2.194599 0.86623 1.145702
C  -1.751206 -0.936823 -0.14645
H  -2.618446 -1.34586 0.377106
C  -0.427402 -1.365785 0.40508
C  0.695277 -1.284459 -0.366015
C  2.007372 -0.687337 0.068179
H  2.220265 -0.878257 1.125691
H  2.858882 -1.024814 -0.527183
C  1.799046 0.891043 -0.144949
H  1.856832 1.131535 -1.211725
H  2.610898 1.423481 0.355202
C  0.423292 1.26152 0.449486
C  -0.752267 1.318819 -0.375626
H  0.530153 -1.212441 -1.445584
H  -1.846309 -1.124723 -1.217463
H  0.105008 0.273201 0.902262
H  -0.622317 1.393872 -1.459255
H  -2.871547 0.987456 -0.526297
H  0.383795 1.835378 1.387576
H  -0.346784 -1.515815 1.483568
totalener: -311.09874811 hartree
nucrepener: 380.82114330 hartree
electener: -691.91989141 hartree
oneelecener: -1161.88144881 hartree
twoeener: 469.96155740 hartree
kineticenergy: 309.69113301 hartree
exchangeener: -12.748871725959 hartree
correlationener: -0.945429927203 hartree
xcener: -13.694301653161 hartree
chargesum: 1.0000000
charge: -0.255381 0.190783 -0.268141 0.198754 -0.141855 -0.104152 -0.245365 0.162845 0.179901 -0.270512 0.166607 0.183660 -0.213190 0.075019 0.172313 0.186462 0.143748 0.212684 0.201598 0.228710 0.195513
charge: 0.120598 0.008217 0.143826 0.008348 0.033017 0.099250 0.083336 -0.004139 -0.002439 0.109918 -0.010347 -0.001332 0.088766 0.282826 -0.013067 -0.002326 0.010166 0.012526 0.007957 0.036673 -0.011776
qa: -0.2554 0.1908 -0.2681 0.1988 -0.1419 -0.1042 -0.2454 0.1628 0.1799 -0.2705 0.1666 0.1837 -0.2132 0.0750 0.1723 0.1865 0.1437 0.2127 0.2016 0.2287 0.1955
va: 3.8866 0.9748 3.9354 0.9671 3.8236 3.8395 3.9028 0.9847 0.9740 3.9115 0.9831 0.9759 3.8407 3.6316 0.9800 0.9747 1.0540 0.9664 0.9696 0.9666 0.9788
energy: -311.809225752187
dipole: 0.06172 -0.71467 -0.65294 0.75891 0.01723 0.77614 0.36535 -0.40791 -0.04256
magnitude: 1.01515 au
magnitude: 2.58031 debye
