program: Orca
programVersion: 5.0.3
elementType: C H C H C C C H H C H H C C H H H H H H H
charge: 1
multiplicity: 1
keywords: DSD-PBEP86/2013 def2-TZVP D3BJ RIJCOSX verytightscf def2-TZVP/C def2/J soscf noTRAH
formula: C8H13
InChI: InChI=1/C8H13/c1-2-4-6-8-7-5-3-1/h1-2,7H,3-6,8H2
21 atoms
C  -2.002287 0.748589 0.069263
H  -2.165995 0.812579 1.147735
C  -1.731773 -0.975169 -0.165306
H  -2.619813 -1.337002 0.357393
C  -0.411445 -1.385725 0.387881
C  0.681712 -1.271167 -0.387058
C  1.996368 -0.699275 0.062917
H  2.199941 -0.908185 1.118588
H  2.853174 -1.036974 -0.526831
C  1.788007 0.84059 -0.133147
H  1.821748 1.104525 -1.196024
H  2.593044 1.391331 0.360572
C  0.425747 1.289644 0.496447
C  -0.765642 1.290842 -0.358668
H  0.516923 -1.190542 -1.466208
H  -1.829139 -1.135363 -1.239803
H  0.219422 0.741716 1.419163
H  -0.658899 1.633695 -1.391646
H  -2.881602 0.99802 -0.523273
H  0.51051 2.35537 0.805363
H  -0.325572 -1.472508 1.470219
totalener: -311.12941302 hartree
nucrepener: 379.16040477 hartree
electener: -690.28981778 hartree
oneelecener: -1158.77938375 hartree
twoeener: 468.48956597 hartree
kineticenergy: 310.02167554 hartree
exchangeener: -14.121121448389 hartree
correlationener: -0.942721417713 hartree
xcener: -15.063842866102 hartree
chargesum: 1.0000000
charge: -0.276158 0.199213 -0.196056 0.192139 -0.207934 -0.103619 -0.211724 0.153390 0.164646 -0.268258 0.152720 0.169682 -0.153015 0.110563 0.139078 0.187014 0.155443 0.216815 0.195123 0.210073 0.170865
charge: -0.166685 0.169157 -0.112606 0.156747 -0.182794 -0.123530 -0.216533 0.148797 0.148632 -0.201038 0.142662 0.150498 -0.205612 0.145309 0.151296 0.152182 0.165228 0.174516 0.157411 0.197711 0.148653
qa: -0.2762 0.1992 -0.1961 0.1921 -0.2079 -0.1036 -0.2117 0.1534 0.1646 -0.2683 0.1527 0.1697 -0.1530 0.1106 0.1391 0.1870 0.1554 0.2168 0.1951 0.2101 0.1709
va: 3.8812 0.9580 3.8273 0.9583 3.8549 3.8443 3.8744 0.9730 0.9731 3.9068 0.9689 0.9661 3.7996 3.5393 0.9688 0.9588 0.9904 0.9432 0.9654 0.9476 0.9645
total: -311.783067796 hartree
dispcorr: -0.014165489 hartree
energy: -311.797233285087
dipole: 0.21888 -1.09816 -0.87928 1.83229 -0.55337 1.27892 0.31390 -0.49942 -0.18552
magnitude: 1.56307 au
magnitude: 3.97300 debye
