program: Gaussian 09
title: 000050942
version: EM64L-G09RevD.01
frameworkgroup: C1[X(C11H14N4O4)]
method: RPBEPBE
basis: SDD
operation: Freq
keyword: #p
keyword: freq=noraman
keyword: PBEPBE/SDD
title: #p freq=noraman PBEPBE/SDD
converged: YES YES NO NO
title: Mulliken charges:
elementType: O O O O N N N N C C C C C C C C C C C H H H H H H H H H H H H H H
charge: -0.290432 -0.261188 -0.284601 -0.268804 -0.172901 -0.150609 -0.222935 -0.095005 -0.410641 0.019411 0.136857 0.077953 -0.296807 -0.313081 0.185071 -0.186189 0.211205 -0.611567 -0.600939 0.300567 0.246962 0.239369 0.234675 0.218695 0.243666 0.220913 0.294680 0.269923 0.247843 0.248023 0.268368 0.250685 0.250833
chargesum: 0.00000
title: Mulliken charges with hydrogens summed into heavy atoms:
elementType: O O O O N N N N C C C C C C C C C C C
charge: -0.290432 -0.261188 -0.284601 -0.268804 -0.172901 -0.150609 -0.222935 -0.095005 0.136889 0.258780 0.136857 0.077953 0.156562 0.151498 0.185071 0.108491 0.211205 0.154222 0.168948
polarizability: 2.19566772e+02 3.49480545e+00 1.66146651e+02 1.14996200e+01 -5.11690220e-01 9.14411505e+01
1716.lowfreq: -10.2573 -6.3500 -2.8988 -0.0005 -0.0003 0.0007 10.2998 34.8789 47.5742
frequency: 2.9042 34.7624 47.5660 57.8581 89.1910 95.3729 113.7268 118.5354 145.4902 155.7675 177.3082 225.2477 264.2777 289.5187 293.9502 304.1857 340.6473 370.7176 379.4430 395.9207 432.8646 458.0512 486.4832 547.7791 609.6279 616.0119 639.6851 669.7932 677.7525 704.5204 736.3797 745.6753 763.3123 782.3425 829.2829 856.7183 897.5519 911.4896 939.1379 957.3794 966.3618 989.8962 1014.1597 1046.7346 1049.4137 1091.7308 1118.3872 1129.9966 1131.9137 1156.5291 1161.1618 1167.5833 1195.8216 1211.5712 1223.2301 1236.2602 1262.1347 1264.1836 1299.1571 1302.8400 1323.6094 1325.7539 1355.2697 1367.0787 1393.5272 1409.0335 1426.4990 1428.5810 1461.3093 1471.1267 1473.8660 1474.7282 1477.3613 1478.4076 1478.9842 1503.4062 1570.7822 1613.7153 1646.3174 2994.2679 2998.2574 3003.6350 3008.3635 3012.9341 3024.0644 3093.4356 3095.6384 3098.0237 3104.8384 3116.1867 3139.4941 3140.3212 3256.9035
redmass: 3.7386 5.0597 5.0486 5.3565 1.8473 1.4979 2.3444 1.4510 3.9477 6.0807 4.6202 2.4977 4.1835 4.2843 4.3039 3.6792 4.0332 6.1549 6.7651 7.5832 8.1970 2.8269 6.1773 6.2207 4.3271 2.4966 6.4824 9.0179 7.0782 10.9131 4.9409 10.3264 4.0626 5.5841 1.4362 2.3444 5.1491 3.8482 2.7463 5.6003 2.7373 3.1373 2.9515 3.3076 3.1977 2.0571 2.2093 1.3009 1.3031 1.8293 1.5545 1.9486 1.2541 1.9662 3.4096 2.0891 1.2567 3.4207 2.9623 2.8317 1.4002 1.2648 2.3026 2.0590 1.7220 1.5947 1.2582 1.8703 1.3304 1.0909 1.0505 1.2247 1.0957 1.0432 1.0827 2.6154 8.1818 10.7271 9.7884 1.0802 1.0751 1.0608 1.0335 1.0328 1.0601 1.1059 1.1023 1.1025 1.1021 1.1025 1.1024 1.1013 1.0995
irintensity: 2.1850 7.9143 0.5103 1.0132 0.1490 0.1565 3.5724 1.2900 5.2598 0.9154 15.0570 1.2659 1.9767 5.0892 3.9406 2.5287 10.0135 14.7448 9.6023 13.4487 11.8596 17.8525 15.9548 0.4781 19.2702 4.4691 5.7068 0.1328 0.1439 9.4789 27.3976 10.2110 22.5690 1.0817 21.3501 1.9034 50.1592 5.6357 21.1029 29.0126 17.3156 51.8508 36.2757 82.1041 37.3080 49.5926 60.6347 0.3849 0.0799 25.5251 28.6584 32.5015 17.1462 62.0060 14.1950 37.0962 13.9916 17.3944 36.8311 4.0194 9.8322 4.3584 17.6932 9.7065 8.3855 35.4189 58.1405 155.9952 69.6193 6.6381 18.0201 37.0075 1.4866 16.2630 2.3261 130.7622 5.3342 655.0090 343.3380 55.3216 38.3080 62.4188 35.7616 27.3909 51.4117 2.9314 30.4697 17.4614 17.1874 23.9325 0.7422 0.5101 6.3911
temp: 298.150 k
press: 1.00000 atm
elementType: 8 8 8 8 7 7 7 7 6 6 6 6 6 6 6 6 6 6 6 1 1 1 1 1 1 1 1 1 1 1 1 1 1
symmnumber: 1
zpe: 669603.8 jmol-1
zpe.correction: 0.255039 hartree
zpe.thermalcorrener: 0.272763 hartree
zpe.thermalcorrenthalpy: 0.273707 hartree
zpe.thermalcorrgfe: 0.205517 hartree
zpe.sumelectzpe: -946.063783 hartree
zpe.sumelectthermal: -946.046059 hartree
zpe.sumelectthermalent: -946.045115 hartree
zpe.sumelectthermalfe: -946.113305 hartree
dipole: -5.6299 -1.3869 -0.1561
dipole: 5.8003
quadrupole: -94.5434 -119.7997 -107.8726
quadrupole: 2.3370 -1.4090 1.6729
quadrupole: 12.8619 -12.3945 -0.4674 2.3370 -1.4090 1.6729
hfenergy: -946.3188215 hartree
pointgroup: C01 [X(C11H14N4O4)]
dipole: 2.1871115 -0.65087 -0.0236438 debye
polarizability: 219.4606615|-6.7076799|166.1742927|8.8957497|5.6666478|91.5196202 unknown
InChI: InChI=1S/C11H14N4O4/c1-13-9-8(10(16)14(2)11(13)17)15(6-12-9)5-7-18-3-4-19-7/h6-7H,3-5H2,1-2H3
charge 0 multiplicity 1
33 atoms
O  3.557874 -1.128423 -0.466433
O  4.026038 1.180092 -0.186943
O  -0.483741 2.462884 0.499027
O  -4.645405 0.39777 -0.31722
N  0.706628 -0.431028 0.393758
N  -2.765584 -1.000318 -0.170179
N  -2.561387 1.394337 0.086726
N  -0.634835 -2.248645 0.026341
C  1.909462 0.385221 0.654341
C  2.949925 0.232452 -0.461216
C  -0.605343 0.053776 0.244342
C  -1.395431 -1.085772 0.022883
C  5.005528 -0.962117 -0.171425
C  5.278981 0.494823 -0.585385
C  -1.139022 1.390426 0.297016
C  0.632308 -1.809637 0.253195
C  -3.40061 0.263341 -0.145156
C  -3.565457 -2.218423 -0.405488
C  -3.25786 2.701692 0.108856
H  1.588652 1.4397 0.713435
H  2.370202 0.09316 1.613668
H  2.510275 0.387417 -1.467064
H  5.551355 -1.707903 -0.770805
H  5.194347 -1.123489 0.906677
H  6.098563 0.98019 -0.035006
H  5.435478 0.588171 -1.677588
H  1.514779 -2.441661 0.29806
H  -4.612094 -1.908364 -0.537114
H  -3.474559 -2.902455 0.454713
H  -3.203522 -2.738458 -1.3080
H  -2.496629 3.475733 0.283747
H  -4.013674 2.71358 0.911057
H  -3.771541 2.871328 -0.851319
