program: Orca
programVersion: 5.0.3
elementType: C H C H C C C H H C H H C C H H H H H H H
charge: 1
multiplicity: 1
keywords: b3lyp cc-pVTZ EnGrad D3BJ RIJCOSX verytightscf cc-pVTZ/C def2/J soscf
formula: C8H13
InChI: InChI=1/C8H13/c1-2-4-6-8-7-5-3-1/h1-2,7H,3-6,8H2
21 atoms
C  -1.996704 0.532596 0.120007
H  -2.173758 0.723856 1.18198
C  -1.946693 -0.994356 -0.171541
H  -2.674962 -1.584656 0.387249
C  -0.512365 -1.154205 0.285966
C  0.613024 -1.133165 -0.500426
C  1.908489 -0.655441 0.066457
H  2.012124 -0.951945 1.115629
H  2.766164 -1.043977 -0.48953
C  1.888343 0.908652 -0.040395
H  2.005624 1.197804 -1.091488
H  2.737528 1.33018 0.50399
C  0.553603 1.481539 0.492915
C  -0.557641 0.851109 -0.269131
H  0.532133 -1.303606 -1.573597
H  -2.05699 -1.200573 -1.240358
H  0.434758 1.348633 1.572998
H  -0.427801 0.913687 -1.352502
H  -2.725754 1.091561 -0.475827
H  0.535185 2.565455 0.291178
H  -0.363521 -1.103872 1.365964
totalener: -312.24887656 hartree
nucrepener: 385.01024815 hartree
electener: -697.25912471 hartree
oneelecener: -1170.89983593 hartree
twoeener: 473.64071122 hartree
kineticenergy: 310.00000429 hartree
exchangeener: -36.320099571979 hartree
correlationener: -2.308291379523 hartree
xcener: -38.628390951502 hartree
chargesum: 1.0000000
charge: -0.162311 0.140992 -0.171360 0.153623 -0.042677 -0.046604 -0.186204 0.135117 0.154241 -0.189273 0.131773 0.152450 -0.167001 -0.027132 0.186024 0.137950 0.135807 0.176901 0.154003 0.169324 0.164360
charge: 0.097927 -0.001080 0.102181 -0.002184 0.125810 0.153062 0.084505 -0.000066 0.005587 0.102275 -0.007181 -0.001249 0.069803 0.243940 -0.002665 -0.001459 -0.001688 0.001771 0.000960 0.025362 0.004388
qa: -0.1623 0.1410 -0.1714 0.1536 -0.0427 -0.0466 -0.1862 0.1351 0.1542 -0.1893 0.1318 0.1524 -0.1670 -0.0271 0.1860 0.1379 0.1358 0.1769 0.1540 0.1693 0.1644
va: 3.8242 0.9916 3.8405 0.9833 3.7677 3.7614 3.8739 0.9909 0.9832 3.8395 0.9880 0.9805 3.8494 3.6653 0.9778 0.9930 0.9914 0.9890 0.9815 0.9753 0.9929
dispcorr: -0.035751568 hartree
energy: -312.284628123564
dipole: 0.56296 -0.73798 -0.17502 1.85581 -1.67117 0.18463 0.18322 -0.32721 -0.14399
magnitude: 0.29233 au
magnitude: 0.74303 debye
