program: Orca
programVersion: 5.0.3
elementType: C H C H C C C H H C H H C C H H H H H H H
charge: 1
multiplicity: 1
keywords: b3lyp cc-pVTZ EnGrad D3BJ RIJCOSX verytightscf cc-pVTZ/C def2/J soscf
formula: C8H13
InChI: InChI=1/C8H13/c1-2-4-6-8-7-5-3-1/h1-2,7H,3-6,8H2
21 atoms
C  -1.998239 0.742476 0.075993
H  -2.187013 0.860334 1.146445
C  -1.745249 -0.942351 -0.148196
H  -2.6183 -1.33511 0.378062
C  -0.425845 -1.371154 0.402488
C  0.693614 -1.283771 -0.367554
C  2.006299 -0.687593 0.066811
H  2.218622 -0.878211 1.124557
H  2.85841 -1.026885 -0.526961
C  1.797075 0.886094 -0.145139
H  1.853523 1.130428 -1.211132
H  2.607235 1.421703 0.35499
C  0.422645 1.25692 0.457491
C  -0.757428 1.316809 -0.377942
H  0.529296 -1.213337 -1.447347
H  -1.843742 -1.123284 -1.219671
H  0.12287 0.321443 1.003508
H  -0.633967 1.432567 -1.458558
H  -2.873592 0.985213 -0.526488
H  0.397966 1.926235 1.332589
H  -0.34575 -1.511993 1.481843
totalener: -312.18941100 hartree
nucrepener: 380.47693999 hartree
electener: -692.66635098 hartree
oneelecener: -1161.88546573 hartree
twoeener: 469.21911475 hartree
kineticenergy: 309.96032904 hartree
exchangeener: -36.290920664105 hartree
correlationener: -2.305336614419 hartree
xcener: -38.596257278525 hartree
chargesum: 1.0000000
charge: -0.193297 0.161153 -0.201598 0.171828 -0.114260 -0.071276 -0.177715 0.130240 0.149600 -0.207042 0.135856 0.152347 -0.167515 0.095871 0.139634 0.158372 0.130953 0.184998 0.174734 0.193775 0.153342
charge: 0.126725 0.007738 0.153324 0.007629 0.031973 0.099325 0.086167 -0.005742 -0.004384 0.112853 -0.012545 -0.002614 0.086795 0.282870 -0.015484 -0.003299 0.014247 0.009016 0.006190 0.035760 -0.016545
qa: -0.1933 0.1612 -0.2016 0.1718 -0.1143 -0.0713 -0.1777 0.1302 0.1496 -0.2070 0.1359 0.1523 -0.1675 0.0959 0.1396 0.1584 0.1310 0.1850 0.1747 0.1938 0.1533
va: 3.8352 0.9840 3.8735 0.9744 3.7896 3.7931 3.8508 0.9926 0.9817 3.8545 0.9903 0.9831 3.8039 3.5849 0.9912 0.9832 1.0354 0.9786 0.9781 0.9783 0.9952
dispcorr: -0.037072270 hartree
energy: -312.226483265158
dipole: 0.08020 -0.76938 -0.68918 0.92736 -0.11759 0.80978 0.40488 -0.45025 -0.04537
magnitude: 1.06432 au
magnitude: 2.70528 debye
