program: Orca
programVersion: 5.0.3
elementType: C H C H C C C H H C H H C C H H H H H H H
charge: 1
multiplicity: 1
keywords: DSD-PBEP86/2013 def2-TZVP D3BJ RIJCOSX verytightscf def2-TZVP/C def2/J soscf noTRAH
formula: C8H13
InChI: InChI=1/C8H13/c1-2-4-6-8-7-5-3-1/h1-2,7H,3-6,8H2
21 atoms
C  -1.991967 0.550086 0.112397
H  -2.167536 0.735738 1.176215
C  -1.897903 -0.980129 -0.174738
H  -2.668406 -1.54961 0.350248
C  -0.482538 -1.226605 0.311295
C  0.627026 -1.181937 -0.478726
C  1.918112 -0.673645 0.071317
H  2.044392 -0.949123 1.123718
H  2.784802 -1.039822 -0.487308
C  1.857306 0.884368 -0.065524
H  1.935311 1.157744 -1.12464
H  2.708227 1.343625 0.445285
C  0.529631 1.470319 0.505938
C  -0.608442 0.992196 -0.29605
H  0.53277 -1.307462 -1.557466
H  -1.983427 -1.177711 -1.247957
H  0.39817 1.268407 1.573006
H  -0.475769 1.105616 -1.37572
H  -2.769664 1.049504 -0.476745
H  0.589458 2.56739 0.379143
H  -0.341566 -1.196967 1.393395
totalener: -311.16046223 hartree
nucrepener: 382.67127351 hartree
electener: -693.83173573 hartree
oneelecener: -1165.70393392 hartree
twoeener: 471.87219819 hartree
kineticenergy: 310.02125431 hartree
exchangeener: -14.126012849308 hartree
correlationener: -0.945535970827 hartree
xcener: -15.071548820135 hartree
chargesum: 1.0000000
charge: -0.206559 0.168155 -0.203905 0.177152 -0.112230 -0.118975 -0.222211 0.156578 0.170889 -0.235565 0.150048 0.173919 -0.193458 0.046434 0.183845 0.161785 0.158718 0.200371 0.179950 0.194532 0.170527
charge: -0.197619 0.156030 -0.194249 0.150130 -0.076948 -0.087125 -0.215161 0.152091 0.155335 -0.203244 0.145733 0.150495 -0.220745 0.140626 0.158872 0.152645 0.155337 0.172796 0.157937 0.185671 0.161393
qa: -0.2066 0.1682 -0.2039 0.1772 -0.1122 -0.1190 -0.2222 0.1566 0.1709 -0.2356 0.1500 0.1739 -0.1935 0.0464 0.1838 0.1618 0.1587 0.2004 0.1800 0.1945 0.1705
va: 3.8524 0.9709 3.8538 0.9707 3.8570 3.8550 3.9006 0.9708 0.9700 3.8651 0.9717 0.9643 3.8997 3.6058 0.9572 0.9743 0.9726 0.9451 0.9693 0.9605 0.9629
total: -311.814177055 hartree
dispcorr: -0.014330691 hartree
energy: -311.828507746419
dipole: 0.54986 -0.93500 -0.38514 1.87905 -1.22684 0.65221 0.16022 -0.32916 -0.16894
magnitude: 0.77605 au
magnitude: 1.97257 debye
