program: Gaussian 09
title: 000050941
version: EM64L-G09RevD.01
frameworkgroup: C1[X(C12H24O)]
method: RPBEPBE
basis: SDD
operation: Freq
keyword: #pfreq=noraman
keyword: PBEPBE/SDD
title: #p freq=noraman PBEPBE/SDD
converged: YES YES NO NO
title: Mulliken charges:
elementType: O C C C C C C C C C C C C H H H H H H H H H H H H H H H H H H H H H H H H
charge: -0.274843 -0.017593 -0.394358 -0.430953 -0.485596 -0.745177 -0.287672 -0.300063 0.368094 -0.204506 -0.786043 -0.794346 -0.678737 0.214677 0.194418 0.199627 0.208522 0.226663 0.199817 0.213288 0.208151 0.212652 0.215642 0.182522 0.196270 0.216957 0.183188 0.181713 0.227120 0.215679 0.213743 0.218697 0.229081 0.218268 0.199885 0.227527 0.227687
chargesum: 0.00000
title: Mulliken charges with hydrogens summed into heavy atoms:
elementType: O C C C C C C C C C C C C
charge: -0.274843 0.197084 -0.000312 0.004232 -0.072491 -0.108733 0.091121 -0.083106 0.368094 0.160395 -0.129501 -0.128301 -0.023639
polarizability: 1.73602879e+02 3.20099982e+00 1.27250418e+02 -4.12141951e+00 -4.30574163e+00 1.13813988e+02
1716.lowfreq: -19.0658 -7.8560 -0.0007 -0.0006 0.0004 11.6247 20.2831 26.5682 43.3012
frequency: 19.8691 26.3882 43.2270 57.5308 74.2256 77.0736 115.0347 127.7240 140.0126 145.5599 169.3034 200.4943 215.3304 231.0856 233.9264 284.4024 321.8230 352.7123 371.2486 386.7419 438.0142 449.7582 482.7482 504.2036 542.3823 728.1684 781.4780 799.3465 816.5559 835.7260 849.5156 860.9030 902.0673 945.8526 954.6401 964.4939 983.1820 992.8552 994.6141 1036.8079 1065.7178 1075.0531 1081.9395 1095.1711 1108.8635 1119.4523 1132.6954 1135.9699 1148.5077 1174.7623 1197.5862 1224.9110 1248.0311 1250.2332 1275.5979 1288.2781 1302.4717 1314.4771 1335.1669 1345.3296 1351.4940 1362.5445 1383.5482 1387.8543 1389.4549 1398.1093 1405.0316 1454.5704 1455.9154 1458.6417 1460.2516 1464.4961 1472.2839 1473.3184 1475.6185 1476.8366 1480.4566 1483.4708 1484.9379 1496.3592 1692.3659 2899.6315 2913.1495 2949.9135 2954.5234 2954.7806 2956.2783 2957.9385 2962.3356 2967.7153 2976.7497 2984.8828 2993.0178 3017.2596 3025.3111 3029.6783 3036.9413 3050.0365 3061.0916 3068.6015 3071.4230 3078.6827 3090.3055 3094.5656 3099.9581
redmass: 3.5933 2.8336 1.7227 3.2122 3.2928 2.6207 2.0140 2.9021 1.0359 2.6502 1.6013 1.3485 1.5344 1.8542 1.2396 2.9781 2.3597 2.5010 2.4594 2.3660 2.4642 2.2005 2.8539 2.4703 2.5983 1.9853 2.0457 1.3604 1.1003 1.6312 1.9983 1.8299 2.0585 1.3855 1.2912 1.6823 1.8843 2.6963 1.2951 1.9102 3.5603 3.3864 1.6768 1.9714 2.1778 1.8604 1.8771 1.7057 1.8591 1.3612 1.6988 1.4411 1.5533 1.1479 1.1739 1.2680 1.1942 1.3313 1.3725 1.3793 1.4473 1.4361 1.2127 1.3208 1.2450 1.2328 1.4532 1.0822 1.0513 1.0412 1.0691 1.0760 1.0627 1.0587 1.0622 1.0663 1.0515 1.0701 1.0771 1.0808 6.4292 1.0567 1.0556 1.0715 1.1023 1.0392 1.1014 1.0697 1.0392 1.0382 1.0649 1.0617 1.0358 1.0978 1.0970 1.0964 1.0974 1.1008 1.0987 1.0987 1.0930 1.0953 1.0990 1.0955 1.1008
irintensity: 0.0367 0.2585 2.9703 0.7405 0.8912 0.0816 0.3562 5.0294 0.2910 1.3191 1.4817 0.0036 0.1074 0.4031 1.1296 0.4864 1.0138 0.8698 3.2070 2.1312 4.4715 3.3699 1.1775 3.7417 0.8187 9.5664 1.6068 0.6004 3.7273 22.8517 2.8248 7.0503 1.1591 1.1214 1.9029 3.2813 22.7126 13.8498 10.1272 6.7580 98.5361 58.9678 4.4712 5.6572 9.9802 18.2201 12.0649 3.7573 4.6086 2.3910 2.1664 2.3923 5.4574 0.1641 4.6333 1.0113 0.5084 0.3434 9.2475 7.7353 33.7772 1.7111 16.7275 27.9723 24.3522 9.8437 3.5132 4.4340 3.1628 10.5407 4.8883 3.5346 24.9648 15.6074 0.7967 15.4279 24.3863 1.2495 2.9846 3.0983 5.7898 29.6318 110.7234 11.7428 75.9655 63.3983 4.4626 36.1305 60.2718 60.2410 14.5022 33.8248 27.9406 47.6546 7.8406 51.2985 37.7670 40.1038 69.2072 42.4587 18.3453 66.9126 38.3109 34.7459 39.2193
temp: 298.150 k
press: 1.00000 atm
elementType: 8 6 6 6 6 6 6 6 6 6 6 6 6 1 1 1 1 1 1 1 1 1 1 1 1 1 1 1 1 1 1 1 1 1 1 1 1
symmnumber: 1
zpe: 873749.9 jmol-1
zpe.correction: 0.332794 hartree
zpe.thermalcorrener: 0.350479 hartree
zpe.thermalcorrenthalpy: 0.351423 hartree
zpe.thermalcorrgfe: 0.284983 hartree
zpe.sumelectzpe: -545.778083 hartree
zpe.sumelectthermal: -545.760398 hartree
zpe.sumelectthermalent: -545.759454 hartree
zpe.sumelectthermalfe: -545.825893 hartree
dipole: -0.1332 0.4983 1.3970
dipole: 1.4892
quadrupole: -75.3243 -83.6232 -84.0872
quadrupole: 0.2360 4.0742 -2.3168
quadrupole: 5.6872 -2.6116 -3.0756 0.2360 4.0742 -2.3168
hfenergy: -546.1108767 hartree
pointgroup: C01 [X(C12H24O1)]
dipole: 0.0547708 0.1698565 -0.5580553 debye
polarizability: 173.7052523|-3.0487439|127.5806724|-3.5891658|3.5893412|113.3813605 unknown
InChI: InChI=1S/C12H24O/c1-5-13-10-9-12(4)8-6-7-11(2)3/h7,12H,5-6,8-10H2,1-4H3
charge 0 multiplicity 1
37 atoms
O  -3.316695 -0.487498 0.28396
C  -0.038408 1.356505 -0.443869
C  1.169056 1.659851 0.486992
C  -1.197839 0.677398 0.33232
C  1.800067 0.434038 1.213733
C  -0.492949 2.663684 -1.13997
C  -2.412127 0.329835 -0.535844
C  2.274055 -0.658853 0.274561
C  3.55849 -0.972284 -0.066931
C  -4.5524 -0.843724 -0.425526
C  3.852946 -2.108095 -1.035863
C  4.791256 -0.256113 0.457621
C  -5.404685 -1.685473 0.524275
H  0.3090 0.653747 -1.231238
H  0.848588 2.398875 1.252119
H  1.958834 2.149047 -0.118744
H  -1.52612 1.333606 1.163423
H  -0.845398 -0.265236 0.791708
H  2.635287 0.798866 1.840103
H  1.055647 0.007879 1.916072
H  -0.913868 3.374213 -0.401687
H  0.36216 3.160697 -1.635296
H  -1.263483 2.480304 -1.910745
H  -2.097018 -0.242633 -1.439873
H  -2.944204 1.244731 -0.878587
H  1.474607 -1.262789 -0.183119
H  -5.092185 0.081642 -0.730982
H  -4.30673 -1.413635 -1.350677
H  2.927351 -2.591489 -1.394264
H  4.483705 -2.88544 -0.559294
H  4.415508 -1.743799 -1.919004
H  5.369705 0.185902 -0.378314
H  4.552582 0.552212 1.167475
H  5.469757 -0.969388 0.966987
H  -6.351903 -1.982117 0.037686
H  -4.860435 -2.59823 0.822138
H  -5.642052 -1.112636 1.437353
