program: Orca
programVersion: 5.0.3
elementType: C H C H C C C H H C H H C C H H H H H H H
charge: 1
multiplicity: 1
keywords: DSD-PBEP86/2013 def2-TZVP RIJCOSX verytightscf def2-TZVP/C def2/J soscf noTRAH
formula: C8H13
InChI: InChI=1/C8H13/c1-2-4-6-8-7-5-3-1/h1-2,7H,3-6,8H2
21 atoms
C  -1.99269 0.51825 0.069649
H  -2.196727 0.788408 1.10905
C  -2.000089 -1.02298 -0.119069
H  -2.680108 -1.577666 0.528049
C  -0.542919 -1.085099 0.291292
C  0.571486 -1.058323 -0.529243
C  1.901142 -0.628134 0.015016
H  2.023895 -1.001549 1.037413
H  2.718463 -1.022373 -0.594112
C  1.936751 0.938966 0.023169
H  2.144529 1.301075 -0.989878
H  2.749179 1.288196 0.665581
C  0.568035 1.46863 0.491322
C  -0.491057 0.707634 -0.262846
H  0.466894 -1.272934 -1.591773
H  -2.158281 -1.315912 -1.160567
H  0.432478 1.370173 1.573775
H  -0.365556 0.802804 -1.344825
H  -2.648052 1.088987 -0.593289
H  0.469965 2.534897 0.245478
H  -0.363203 -1.028083 1.36546
totalener: -311.18664208 hartree
nucrepener: 387.54035739 hartree
electener: -698.72699946 hartree
oneelecener: -1175.28722166 hartree
twoeener: 476.56022220 hartree
kineticenergy: 310.03232458 hartree
exchangeener: -12.767611106741 hartree
correlationener: -0.950261407958 hartree
xcener: -13.717872514698 hartree
chargesum: 1.0000000
charge: -0.198776 0.164733 -0.194541 0.178202 -0.056188 -0.040177 -0.226674 0.160974 0.176784 -0.239820 0.153163 0.171024 -0.218759 -0.049823 0.212546 0.160251 0.145718 0.169619 0.173365 0.173569 0.184810
charge: -0.179478 0.152647 -0.176931 0.149470 -0.052648 0.002221 -0.199989 0.156130 0.156823 -0.207555 0.145994 0.150029 -0.222116 -0.009579 0.168044 0.151781 0.149000 0.175511 0.147804 0.165772 0.177069
qa: -0.1988 0.1647 -0.1945 0.1782 -0.0562 -0.0402 -0.2267 0.1610 0.1768 -0.2398 0.1532 0.1710 -0.2188 -0.0498 0.2125 0.1603 0.1457 0.1696 0.1734 0.1736 0.1848
va: 3.8753 0.9741 3.8805 0.9726 3.8410 3.7622 3.9045 0.9661 0.9684 3.8898 0.9709 0.9697 3.9230 3.7535 0.9393 0.9736 0.9725 0.9628 0.9710 0.9679 0.9568
total: -311.871339222 hartree
energy: -311.871339222467
dipole: 0.55616 -0.71703 -0.16087 1.83094 -1.97414 -0.14321 0.23448 -0.43021 -0.19573
magnitude: 0.29103 au
magnitude: 0.73973 debye
