program: Orca
programVersion: 5.0.3
charge: 1
multiplicity: 1
keywords: DLPNO-CCSD(T1) tightPNO Extrapolate(3/4,def2) RIJK def2/JK verytightSCF miniprint nopop
formula: C8H13
InChI: InChI=1/C8H13/c1-2-4-6-8-7-5-3-1/h1-2,7H,3-6,8H2
21 atoms
C  -1.999609 0.735336 0.077719
H  -2.194599 0.86623 1.145702
C  -1.751206 -0.936823 -0.14645
H  -2.618446 -1.34586 0.377106
C  -0.427402 -1.365785 0.40508
C  0.695277 -1.284459 -0.366015
C  2.007372 -0.687337 0.068179
H  2.220265 -0.878257 1.125691
H  2.858882 -1.024814 -0.527183
C  1.799046 0.891043 -0.144949
H  1.856832 1.131535 -1.211725
H  2.610898 1.423481 0.355202
C  0.423292 1.26152 0.449486
C  -0.752267 1.318819 -0.375626
H  0.530153 -1.212441 -1.445584
H  -1.846309 -1.124723 -1.217463
H  0.105008 0.273201 0.902262
H  -0.622317 1.393872 -1.459255
H  -2.871547 0.987456 -0.526297
H  0.383795 1.835378 1.387576
H  -0.346784 -1.515815 1.483568
e0: -310.242628442 hartree
corrType: DLPNO BASED
e0: -310.256247778 hartree
basis: def2-TZVPP def2-QZVPP
scfener: -310.242628442 -310.256247778
corrmethod: MDCI MDCI
correner: -1.464261489 -1.534610576
corrcbsextra: -1.586720973
energy: -311.844844661207
dipole: 0.06172 -0.82283 -0.76111 0.75891 0.31906 1.07796 0.36535 -0.51467 -0.14932
magnitude: 1.32800 au
magnitude: 3.37551 debye
