program: Gaussian 09
title: 000050945
version: EM64L-G09RevD.01
frameworkgroup: C1[X(C10H13NO5S)]
method: RPBEPBE
basis: SDD
operation: Freq
keyword: #p
keyword: freq=noraman
keyword: PBEPBE/SDD
title: #p freq=noraman PBEPBE/SDD
converged: YES YES NO NO
title: Mulliken charges:
elementType: S O O O O O N C C C C C C C C C C H H H H H H H H H H H H H
charge: 0.949602 -0.255126 -0.540659 -0.527508 -0.315315 -0.235513 -0.721929 -0.223502 0.376586 0.370558 -0.208667 -0.480675 -0.362884 0.183604 -0.249410 -0.681109 -0.515487 0.303048 0.290931 0.269123 0.215925 0.221513 0.336669 0.350470 0.213838 0.235639 0.234108 0.266141 0.274559 0.225471
chargesum: 0.00000
title: Mulliken charges with hydrogens summed into heavy atoms:
elementType: S O O O O O N C C C C C C C C C C
charge: 0.949602 -0.255126 -0.540659 -0.527508 -0.315315 -0.235513 -0.034790 -0.223502 0.376586 0.370558 0.094382 -0.189744 -0.093761 0.183604 0.188027 0.002476 0.250684
polarizability: 2.25250995e+02 4.28999527e-01 1.67642820e+02 4.62706013e+00 -4.66253479e+00 9.94762247e+01
1716.lowfreq: -7.8778 -5.0992 -3.5909 -0.0016 -0.0014 0.0021 39.4829 43.5851 72.9981
frequency: 39.4740 43.5674 72.9876 90.6805 97.6319 99.6480 105.2711 127.0956 138.2854 173.4590 188.7123 202.5270 219.0967 239.7938 244.6695 266.3910 272.8882 300.8439 342.6092 357.4998 374.3165 382.1926 409.9391 438.0041 448.9368 482.6800 510.0197 576.1532 628.6291 652.0585 695.3486 741.4635 752.2103 777.8920 814.0566 820.9465 825.5475 855.6188 889.1801 898.9918 920.0445 959.5626 987.7165 992.4428 1030.3979 1067.2109 1092.3755 1114.5256 1119.8429 1132.0511 1134.4635 1160.4108 1196.7105 1240.9275 1265.0291 1276.6308 1367.2719 1388.4295 1399.5696 1403.5054 1410.7769 1457.6942 1460.3099 1461.3341 1477.2227 1478.2405 1487.8173 1503.9412 1581.3481 1595.5956 1635.6774 2966.5086 3000.2120 3010.0678 3028.3037 3097.8736 3109.6173 3128.0887 3141.9971 3151.3242 3173.1601 3177.9917 3377.8099 3555.1213
redmass: 4.8975 5.9493 3.1629 2.6984 1.5884 3.0221 2.4347 3.6419 3.6074 4.3562 4.6017 6.0599 4.7944 1.4720 2.3762 3.1551 4.3711 5.8966 4.4399 5.0654 5.8129 2.6840 5.5145 4.3621 5.2724 3.8581 4.6591 4.5663 6.2587 6.5722 4.6709 5.2273 3.8271 2.0790 5.2772 2.4656 1.4070 1.4137 3.1284 1.9799 7.0517 5.0650 1.3432 6.5935 2.6245 1.5388 2.0703 1.9253 1.4484 1.4169 1.4393 1.4782 2.5612 2.3441 1.1415 1.8524 1.3509 3.9861 2.1217 1.9196 1.3215 1.0515 2.3554 1.0395 1.1146 1.0549 1.1033 1.0971 8.3811 5.9602 10.3173 1.0556 1.0363 1.0278 1.1080 1.0989 1.1016 1.1059 1.1059 1.0898 1.0911 1.0958 1.0403 1.1017
irintensity: 2.6738 1.3248 4.5138 0.3814 0.3105 0.5758 2.5969 3.9610 2.0499 2.1735 4.4836 11.3893 5.8555 4.9685 11.9018 11.2384 2.7925 3.8846 23.4255 6.3527 8.2858 35.7222 13.9790 45.6019 51.5099 120.6980 14.3884 36.3062 0.2780 1.2026 4.0190 12.1278 1.5574 111.7852 44.0517 25.6285 10.3845 38.4161 29.0810 29.1866 93.5172 111.8262 1.5113 28.2959 83.8811 76.7285 53.0832 10.5030 0.2756 8.9524 5.1790 11.6601 85.8233 311.0897 1.7751 196.7610 7.1400 94.7654 15.7774 35.7235 94.0587 19.9524 51.3442 12.9687 6.5897 14.0348 5.1238 27.8923 37.8641 111.2834 167.7571 28.1313 21.8953 32.2109 26.7730 23.4604 31.3154 9.3466 8.0495 6.1742 3.6103 5.3458 21.7063 51.3018
temp: 298.150 k
press: 1.00000 atm
elementType: 16 8 8 8 8 8 7 6 6 6 6 6 6 6 6 6 6 1 1 1 1 1 1 1 1 1 1 1 1 1
symmnumber: 1
zpe: 582069.8 jmol-1
zpe.correction: 0.221699 hartree
zpe.thermalcorrener: 0.240349 hartree
zpe.thermalcorrenthalpy: 0.241293 hartree
zpe.thermalcorrgfe: 0.174715 hartree
zpe.sumelectzpe: -1216.317815 hartree
zpe.sumelectthermal: -1216.299165 hartree
zpe.sumelectthermalent: -1216.298221 hartree
zpe.sumelectthermalfe: -1216.364799 hartree
dipole: -3.2751 3.1321 3.4912
dipole: 5.7206
quadrupole: -87.1036 -110.9969 -113.4846
quadrupole: 9.2094 12.1433 2.6627
quadrupole: 16.7581 -7.1352 -9.6229 9.2094 12.1433 2.6627
hfenergy: -1216.539514 hartree
pointgroup: C01 [X(C10H13N1O5S1)]
dipole: 1.3111542 -1.2318507 1.3523495 debye
polarizability: 224.9774278|0.0876023|167.7009124|-7.4736443|4.2255849|99.6917002 unknown
InChI: InChI=1S/C10H13NO5S/c1-3-16-7-4-5-9(17(11,13)14)8(6-7)10(12)15-2/h4-6H,3,11H2,1-2H3
charge 0 multiplicity 1
30 atoms
S  -2.483679 1.070687 0.002906
O  3.576016 0.631321 0.163858
O  -2.692287 2.670574 -0.203691
O  -3.14213 0.054264 -1.08799
O  -1.939574 -1.770166 0.783284
O  -0.29817 -2.843697 -0.482606
N  -3.013674 0.771757 1.719178
C  -0.612637 0.771231 0.158011
C  -0.009127 -0.505044 0.127082
C  2.185431 0.604136 0.16282
C  0.148066 1.954617 0.197591
C  1.407375 -0.577389 0.112916
C  1.549141 1.872558 0.211395
C  -0.735425 -1.814137 0.077024
C  4.304828 -0.659262 0.085741
C  5.792263 -0.324108 0.095096
C  -2.891294 -2.889551 0.552748
H  -0.367835 2.920493 0.194436
H  1.859799 -1.570843 0.056139
H  2.169655 2.77229 0.245799
H  4.024051 -1.286643 0.955718
H  4.011409 -1.18423 -0.845337
H  -3.928681 1.220919 1.878369
H  -2.968163 -0.241108 1.911033
H  6.387267 -1.253299 0.036474
H  6.054564 0.313402 -0.765973
H  6.067449 0.209405 1.020558
H  -2.343306 -3.785032 0.220776
H  -3.60104 -2.550122 -0.219204
H  -3.396894 -3.067924 1.51325
