program: Orca
programVersion: 5.0.3
elementType: C H C H C C C H H C H H C C H H H H H H H
charge: 1
multiplicity: 1
keywords: b3lyp cc-pVTZ EnGrad RIJCOSX verytightscf cc-pVTZ/C def2/J soscf
formula: C8H13
InChI: InChI=1/C8H13/c1-2-4-6-8-7-5-3-1/h1-2,7H,3-6,8H2
21 atoms
C  -1.999366 0.759537 0.069766
H  -2.161951 0.828418 1.148025
C  -1.72973 -0.968504 -0.159322
H  -2.618448 -1.319428 0.369382
C  -0.415584 -1.387202 0.392263
C  0.685547 -1.275468 -0.378849
C  2.000817 -0.692747 0.062737
H  2.20832 -0.891782 1.119691
H  2.855559 -1.034645 -0.526958
C  1.788637 0.855035 -0.139386
H  1.828645 1.116513 -1.202496
H  2.592399 1.404273 0.357939
C  0.422172 1.264708 0.490723
C  -0.767738 1.299402 -0.371573
H  0.520807 -1.199802 -1.458405
H  -1.833248 -1.128188 -1.233001
H  0.193851 0.60682 1.3345
H  -0.659345 1.599145 -1.417608
H  -2.882934 0.993179 -0.522485
H  0.474789 2.267894 0.964205
H  -0.333752 -1.485087 1.4742
totalener: -312.20780897 hartree
nucrepener: 379.43143681 hartree
electener: -691.63924579 hartree
oneelecener: -1159.91447871 hartree
twoeener: 468.27523293 hartree
kineticenergy: 309.98774575 hartree
exchangeener: -36.296025029966 hartree
correlationener: -2.303597663027 hartree
xcener: -38.599622692993 hartree
chargesum: 1.0000000
charge: -0.200387 0.169924 -0.187737 0.174761 -0.119253 -0.087546 -0.169416 0.126575 0.145405 -0.201757 0.131477 0.149695 -0.178306 0.106642 0.133583 0.163712 0.131891 0.201361 0.175802 0.187477 0.146097
charge: 0.135470 0.012199 0.177325 0.006307 0.023277 0.076174 0.078694 -0.005590 -0.004304 0.109208 -0.013063 -0.002125 0.081993 0.299548 -0.017847 -0.002420 0.006664 0.014188 0.004471 0.043766 -0.023934
qa: -0.2004 0.1699 -0.1877 0.1748 -0.1193 -0.0875 -0.1694 0.1266 0.1454 -0.2018 0.1315 0.1497 -0.1783 0.1066 0.1336 0.1637 0.1319 0.2014 0.1758 0.1875 0.1461
va: 3.8318 0.9811 3.8535 0.9722 3.7865 3.8024 3.8541 0.9935 0.9836 3.8427 0.9904 0.9811 3.8389 3.5445 0.9934 0.9810 1.0097 0.9722 0.9802 0.9724 0.9960
energy: -312.207808971162
dipole: 0.17293 -1.02936 -0.85643 1.64566 -0.56074 1.08492 0.38114 -0.49588 -0.11474
magnitude: 1.38697 au
magnitude: 3.52540 debye
