program: Orca
programVersion: 5.0.3
elementType: C H C H C C C H H C H H C C H H H H H H H
charge: 1
multiplicity: 1
keywords: PBE0 def2-TZVP EnGrad RIJCOSX verytightscf def2/J soscf
formula: C8H13
InChI: InChI=1/C8H13/c1-2-4-6-8-7-5-3-1/h1-2,7H,3-6,8H2
21 atoms
C  -1.994902 0.613941 0.081506
H  -2.172929 0.777979 1.150831
C  -1.806203 -0.952561 -0.171762
H  -2.64365 -1.463335 0.312556
C  -0.428946 -1.326908 0.361361
C  0.658712 -1.25039 -0.427451
C  1.957176 -0.702784 0.07147
H  2.134742 -0.941793 1.125059
H  2.823917 -1.034199 -0.510576
C  1.815598 0.843005 -0.109183
H  1.85371 1.101016 -1.173579
H  2.641162 1.367692 0.379755
C  0.468111 1.396488 0.507121
C  -0.707295 1.205454 -0.326423
H  0.522584 -1.241817 -1.511707
H  -1.863698 -1.146406 -1.247457
H  0.312193 1.039586 1.527501
H  -0.617819 1.542477 -1.364214
H  -2.835075 0.989432 -0.510219
H  0.614849 2.497091 0.539769
H  -0.314721 -1.38023 1.444807
totalener: -312.05249271 hartree
nucrepener: 379.85044760 hartree
electener: -691.90294031 hartree
oneelecener: -1160.75720436 hartree
twoeener: 468.85426405 hartree
kineticenergy: 310.15667317 hartree
exchangeener: -34.169310955275 hartree
correlationener: -1.962067570648 hartree
xcener: -36.131378525923 hartree
chargesum: 1.0000000
charge: -0.195553 0.178604 -0.217182 0.176933 -0.159493 -0.116650 -0.215396 0.159964 0.170054 -0.257657 0.160436 0.175982 -0.142899 0.038768 0.152173 0.171006 0.163266 0.206138 0.182504 0.205943 0.163058
charge: -0.197311 0.171726 -0.190722 0.156956 -0.120897 -0.138134 -0.225160 0.156548 0.162373 -0.197796 0.151773 0.157183 -0.214996 0.140454 0.158796 0.158609 0.164857 0.175485 0.166739 0.207791 0.155724
qa: -0.1956 0.1786 -0.2172 0.1769 -0.1595 -0.1166 -0.2154 0.1600 0.1701 -0.2577 0.1604 0.1760 -0.1429 0.0388 0.1522 0.1710 0.1633 0.2061 0.1825 0.2059 0.1631
va: 3.8977 0.9656 3.8967 0.9669 3.9435 3.9045 3.9353 0.9702 0.9702 3.9560 0.9670 0.9620 3.8912 3.7026 0.9656 0.9695 0.9783 0.9432 0.9671 0.9539 0.9639
energy: -312.052492707719
dipole: 0.42650 -0.91883 -0.49233 1.97302 -0.79406 1.17897 0.15210 -0.27515 -0.12304
magnitude: 1.28355 au
magnitude: 3.26251 debye
