program: Orca
programVersion: 5.0.3
elementType: C H C H C C C H H C H H C C H H H H H H H
charge: 1
multiplicity: 1
keywords: DSD-PBEP86 cc-pVTZ EnGrad D3BJ RIJCOSX verytightscf cc-pVTZ/C def2/J soscf
formula: C8H13
InChI: InChI=1/C8H13/c1-2-4-6-8-7-5-3-1/h1-2,7H,3-6,8H2
21 atoms
C  -1.994847 0.538912 0.118492
H  -2.170767 0.727541 1.181287
C  -1.927856 -0.988595 -0.173392
H  -2.672866 -1.571904 0.371364
C  -0.500787 -1.18354 0.294978
C  0.618491 -1.152679 -0.492777
C  1.911549 -0.662715 0.068908
H  2.023149 -0.95109 1.119536
H  2.773661 -1.042259 -0.486919
C  1.875506 0.899231 -0.049909
H  1.976302 1.181689 -1.104663
H  2.726816 1.33548 0.479628
C  0.545077 1.479598 0.498377
C  -0.576987 0.90604 -0.280009
H  0.533511 -1.308019 -1.568042
H  -2.028382 -1.189903 -1.24433
H  0.421084 1.322428 1.574341
H  -0.442187 0.976418 -1.362398
H  -2.743937 1.076158 -0.473474
H  0.557806 2.569716 0.323906
H  -0.354541 -1.138018 1.375722
totalener: -311.14439845 hartree
nucrepener: 384.06534741 hartree
electener: -695.20974586 hartree
oneelecener: -1168.40456566 hartree
twoeener: 473.19481980 hartree
kineticenergy: 309.73279082 hartree
exchangeener: -13.668884545716 hartree
correlationener: -0.924973556244 hartree
xcener: -14.593858101960 hartree
chargesum: 1.0000000
charge: -0.223386 0.170079 -0.229828 0.183237 -0.077999 -0.093559 -0.247535 0.163843 0.182079 -0.247374 0.157738 0.182190 -0.233308 -0.031988 0.220775 0.166279 0.167351 0.210117 0.183603 0.201195 0.196494
charge: 0.090734 0.000877 0.095252 -0.000614 0.126820 0.138542 0.077998 0.000391 0.006139 0.098807 -0.006369 -0.000364 0.064453 0.268872 -0.002790 0.000086 0.000366 0.004511 0.003923 0.028908 0.003458
qa: -0.2234 0.1701 -0.2298 0.1832 -0.0780 -0.0936 -0.2475 0.1638 0.1821 -0.2474 0.1577 0.1822 -0.2333 -0.0320 0.2208 0.1663 0.1674 0.2101 0.1836 0.2012 0.1965
va: 3.8666 0.9846 3.8869 0.9763 3.8112 3.8111 3.9199 0.9846 0.9766 3.8894 0.9821 0.9723 3.9030 3.6937 0.9626 0.9867 0.9833 0.9706 0.9750 0.9667 0.9779
dispcorr: -0.011894194 hartree
energy: -311.849520824225
dipole: 0.56195 -0.79213 -0.23018 1.86114 -1.57478 0.28636 0.17409 -0.31509 -0.14100
magnitude: 0.39353 au
magnitude: 1.00028 debye
