program: Orca
programVersion: 5.0.3
elementType: C H C H C C C H H C H H C C H H H H H H H
charge: 1
multiplicity: 1
keywords: PBE0 def2-TZVP EnGrad D3BJ RIJCOSX verytightscf def2/J soscf
formula: C8H13
InChI: InChI=1/C8H13/c1-2-4-6-8-7-5-3-1/h1-2,7H,3-6,8H2
21 atoms
C  -1.998339 0.75978 0.070474
H  -2.163256 0.83412 1.148088
C  -1.730615 -0.964666 -0.157114
H  -2.618364 -1.316722 0.372606
C  -0.417467 -1.386087 0.393727
C  0.686796 -1.277231 -0.3763
C  2.00195 -0.691041 0.063101
H  2.210618 -0.887294 1.120398
H  2.856141 -1.033635 -0.526784
C  1.78975 0.860914 -0.141242
H  1.833106 1.120234 -1.204673
H  2.593797 1.408585 0.357239
C  0.421775 1.258921 0.486987
C  -0.767682 1.302657 -0.375002
H  0.522481 -1.203581 -1.456049
H  -1.835038 -1.1258 -1.230465
H  0.183853 0.556153 1.29238
H  -0.658541 1.577396 -1.4278
H  -2.881971 0.990226 -0.523044
H  0.461553 2.225289 1.030304
H  -0.336615 -1.489372 1.475453
totalener: -312.03348926 hartree
nucrepener: 379.55822723 hartree
electener: -691.59171650 hartree
oneelecener: -1160.16757849 hartree
twoeener: 468.57586199 hartree
kineticenergy: 310.16441455 hartree
exchangeener: -34.165223044742 hartree
correlationener: -1.961631400984 hartree
xcener: -36.126854445726 hartree
chargesum: 1.0000000
charge: -0.249431 0.201932 -0.213368 0.197595 -0.209006 -0.078737 -0.226524 0.160736 0.166633 -0.270431 0.158844 0.171578 -0.160913 0.071627 0.137755 0.190597 0.157344 0.201416 0.196926 0.220142 0.175284
charge: -0.166205 0.174376 -0.121989 0.166309 -0.191105 -0.114875 -0.223521 0.154653 0.153939 -0.208920 0.148758 0.157305 -0.214632 0.093247 0.156458 0.158613 0.183020 0.173089 0.163835 0.204133 0.153513
qa: -0.2494 0.2019 -0.2134 0.1976 -0.2090 -0.0787 -0.2265 0.1607 0.1666 -0.2704 0.1588 0.1716 -0.1609 0.0716 0.1378 0.1906 0.1573 0.2014 0.1969 0.2201 0.1753
va: 3.9190 0.9567 3.8810 0.9551 3.9113 3.9083 3.9139 0.9695 0.9733 3.9698 0.9680 0.9667 3.8311 3.7089 0.9677 0.9584 1.0033 0.9523 0.9635 0.9456 0.9610
dispcorr: -0.018986918 hartree
energy: -312.052476180426
dipole: 0.15706 -1.01150 -0.85444 1.55031 -0.47088 1.07943 0.40052 -0.50714 -0.10663
magnitude: 1.38080 au
magnitude: 3.50971 debye
